{"text_format":"1","workbook":"xlsx","n_sheets":11,"sheets":["Cover Page","Clinton Movement","Wolverine Movement","Access Road Cracks","Downcutting","Drop Structures - TF","Drop Structures - All","Clinton Stats","Wolv Stats","Clinton Movement Nov. 2","Wolverine Movement Nov. 2"],"not_rendered":{"charts":21,"images":0,"macros":1,"external_links":2,"defined_names":16,"comments":0,"pivot_tables":0},"unopened":[],"bounds":{"document_bytes":16777216,"sheet_cells":100000,"rows_first":2000,"rows_last":500,"rows_between":2000,"halvings":0,"cell_chars":16384,"cell_head_chars":4096},"cells_cut":0,"cells_raw":0,"read":"whole","date_system":"1900"}

{"sheet":"Cover Page","index":0,"n_rows":25,"n_cols":2,"rows_kept":25,"cut":false,"hidden":false,"merged":[]}
["Project Name:","Clinton Creek LTMP"]
["Project Number:","307071-01056"]
["AAM contact:","Josée Perron"]
[]
["Disclaimer:"]
["The information presented in this document was compiled and interpreted exclusively for the purposes stated in "]
["Section 1 of the accompanying report (Clinton Creek Long-Term Monitoring Program - 2015 Survey Results, Advisian, 2015). "]
["Advisian provided this report for AAM solely for the purpose noted therein."]
[]
["Advisian has exercised reasonable skill, care, and diligence to assess the information acquired during the compilation of the following data."]
["Advisian does not accept any responsibility for the use of this report for any purpose other than that stated in Section 1 of the accompanying report "]
["and does not accept responsibility to any third party for the use in whole or in part of the contents of this report. Any alternative use, including that "]
["by a third party, or any reliance on, or decisions based on this document, is the responsibility of the alternative user or third party"]
[]
["Prepared by","JG"]
["Checked by","AT"]
["Approved by","AT"]
[]
["Date"]
[]
["Notes:"]
["Results included in this spreadsheet correspond to movement rates over the specific time frames discussed in the report inclusive of movement between 2003-2014 (Clinton Creek Waste Rock and Porcupine Pit) and 2006-2014 (Wolverine Tailings Pile)"]
["These timeframes were selected as they represent significant periods of change to the mine site, specifically the 2010 extreme flow"]
["Results are presented in centimetres"]
["Relative Percent Change (RPC) is calculated as (Value 2 - Value 1) / Value 1 * 100%"]

{"sheet":"Clinton Movement","index":1,"n_rows":103,"n_cols":35,"rows_kept":103,"cut":false,"hidden":false,"merged":[[8,27,8,28],[8,29,8,30],[0,0,0,3],[8,18,8,19],[8,21,8,22],[8,23,8,24]]}
["Upper",null,null,null,null,"2003-2010",null,{"$f":"(B4-B3)/365","v":6.9205479452054792},"Upper"]
["Monitor","Date","Northing\n(m)","Easting\n(m)",null,"Point","dN","dE","Movement","N/S","E/W","Quadrant","Azimuth","Max",null,null,null,null,null,null,null,{"$f":"(11.7-5.42)/5.42","v":1.158671586715867}]
["81-1","2003-08-20",7147034.8200000003,512978.93,null,{"$f":"A3","v":"81-1"},{"$f":"C4-C3","v":1.9999999552965164E-2},{"$f":"D4-D3","v":0},{"$f":"(G3^2+H3^2)^0.5*100","v":1.9999999552965164},{"$f":"IF(G3>0,2,0)","v":2},{"$f":"IF(H3>0,1,0)","v":0},{"$f":"SUM(J3:K3)","v":2},0,{"$f":"MAX(I3:I10)","v":19.235384053561472},{"$f":"N3/H1","v":2.7794596910332294},"cm/yr",{"$f":"I3/$H$1","v":0.28899445118100892}]
["81-1","2010-07-20",7147034.8399999999,512978.93,null,{"$f":"A9","v":223},{"$f":"C10-C9","v":0.14000000059604645},{"$f":"D10-D9","v":1.0000000009313226E-2},14.035668907137724,2,1,3,{"$f":"IF(L4=3,(ATAN(H4/G4)*180/PI()),IF(L4=1,(90+ATAN(ABS(G4)/ABS(H4))*180/PI()),IF(L4=0,(180+ATAN(ABS(H4)/ABS(G4))*180/PI()),IF(L4=2,(270+ATAN(ABS(G4)/ABS(H4))*180/PI()),\"ERROR\"))))","v":4.0856167664315128},null,null,null,{"$f":"I4/$H$1","v":2.0281152617202176}]
["81-1","2010-09-25",7147034.8300000001,512978.94,null,{"$f":"A15","v":225},{"$f":"C16-C15","v":0.11000000033527613},{"$f":"D16-D15","v":-2.9999999969732016E-2},11.401754282541205,2,0,2,344.74488135594703,null,null,null,1.6475218975168409]
["81-1","2012-08-06",7147034.8600000003,512978.94,null,{"$f":"A21","v":1195},{"$f":"C22-C21","v":0.10999999940395355},{"$f":"D22-D21","v":-1.0000000009313226E-2},11.045360957911718,2,0,2,354.80557105946139,null,null,null,1.5960240497378375]
["81-1","2014-09-11",7147034.8430000003,512978.96399999998,null,{"$f":"A27","v":1834},{"$f":"C28-C27","v":0.16999999992549419},{"$f":"D28-D27","v":-8.999999996740371E-2},19.235384053561472,2,0,2,332.10272896724962,null,null,null,2.7794596910332294,"North"]
["81-1","2015-09-17",7147034.8499999996,512978.97100000002]
[223,"2003-08-20",7146978.0499999998,512942.74,null,null,null,null,null,null,null,null,null,null,null,null,null,null,"Upper",null,null,186,null,2836,null,null,null,"BH-4",null,"BH-4 Cable"]
[223,"2010-07-20",7146978.1900000004,512942.75,null,null,null,null,null,null,null,null,null,null,null,null,null,null,"Avg","Azimuth","Max","Movement","Azimuth","Movement","Azimuth","Delta Movement","Delta Azimuth","Movement","Azimuth","Movement","Azimuth","Delta Movement","Delta Azimuth"]
[223,"2010-09-25",7146978.1699999999,512942.78,null,null,null,null,null,null,null,null,null,null,null,null,null,"TF-WR-A",{"$f":"I15","v":1.6680230702378269},{"$f":"O13","v":347.69198418478214},{"$f":"O3","v":2.7794596910332294}]
[223,"2012-08-06",7146978.25,512942.76,null,null,null,null,null,null,null,null,null,null,null,null,null,"TF-WR-B",{"$f":"I30","v":19.831536111037224},{"$f":"O29","v":108.43494875622095},{"$f":"O18","v":33.137437643787955}]
[223,"2014-09-11",7146978.2709999997,512942.78700000001,null,null,{"$f":"SUM(G3:G10)","v":0.54999999981373549},{"$f":"SUM(H3:H10)","v":-0.11999999993713573},{"$f":"AVERAGE(I3:I10)","v":11.543633631289728},{"$f":"_xlfn.STDEV.S(I3:I7)","v":6.2594451336116137},null,null,null,"avg bearing",{"$f":"270+ATAN(G13/ABS(H13))*180/PI()","v":347.69198418478214},null,null,"TF-WR-C",{"$f":"I45","v":2.758565736491926},{"$f":"O44","v":338.62937768418476},{"$f":"O34","v":4.4197754911953728}]
[223,"2015-09-17",7146978.2980000004,512942.77100000001,null,null,null,null,null,null,null,null,null,null,null,null,null,"TF-WR-D",{"$f":"I60","v":3.1238990459520841},{"$f":"O59","v":78.859681333348263},{"$f":"O49","v":8.9247053574244166},{"$f":"I56/H47","v":8.9247053574244166},{"$f":"M56","v":83.254420388263483},{"$f":"I55/H47","v":6.6110155831323283},{"$f":"M55","v":76.664893797560921},{"$f":"V14-X14","v":2.3136897742920883},{"$f":"W14-Y14","v":6.5895265907025617},{"$f":"I54/H47","v":1.467902446337676},{"$f":"M54","v":125.75388612283803},{"$f":"I58/H47","v":6.0560672759683847},{"$f":"M58","v":238.18576137816737},{"$f":"AB14-AD14","v":-4.5881648296307089},{"$f":"AC14-AE14","v":-112.43187525532935}]
[225,"2003-08-20",7146918.7199999997,512905.22,null,null,null,null,{"$f":"I13/H1","v":1.6680230702378269},"cm/yr",null,null,null,null,null,null,null,"TF-WR-E",{"$f":"I75","v":4.9216452287252359},{"$f":"O74","v":42.386653790701921},{"$f":"O64","v":14.678824932719149},{"$f":"I71/H62","v":5.419094729228938},{"$f":"M71","v":93.122130005936697},{"$f":"I70/H62","v":11.743867636023221},{"$f":"M70","v":74.450195987583541},{"$f":"V15-X15","v":-6.3247729067942835},{"$f":"W15-Y15","v":18.671934018353156},{"$f":"I69/H62","v":1.9404111578583387},{"$f":"M69","v":239.53445329727259},{"$f":"I73/H62","v":14.678824932719149},{"$f":"M73","v":44.728457884124538},{"$f":"AB15-AD15","v":-12.73841377486081},{"$f":"AC15-AE15","v":194.80599541314805}]
[225,"2010-07-20",7146918.8300000001,512905.19,null,"2010 to 2010",null,{"$f":"(B5-B4)/365","v":0.18356164383561643},"Upper",null,null,null,null,null,null,null,null,null,null,null,null,null,"Without BH-4 Cable and 2836"]
[225,"2010-09-25",7146918.8399999999,512905.24,null,"Point","dN","dE","Movement","N/S","E/W","Quadrant","Azimuth","Max",null,null,null,null,"RPC","Δ°","RPC",null,null,"RPC","Δ°","RPC"]
[225,"2012-08-06",7146918.8899999997,512905.21,null,{"$f":"A4","v":"81-1"},{"$f":"C5-C4","v":-9.9999997764825821E-3},{"$f":"D5-D4","v":1.0000000009313226E-2},{"$f":"(G18^2+H18^2)^0.5*100","v":1.4142135472265716},{"$f":"IF(G18>0,2,0)","v":0},{"$f":"IF(H18>0,1,0)","v":1},{"$f":"SUM(J18:K18)","v":1},{"$f":"IF(L18=3,(ATAN(H18/G18)*180/PI()),IF(L18=1,(90+ATAN(ABS(G18)/ABS(H18))*180/PI()),IF(L18=0,(180+ATAN(ABS(H18)/ABS(G18))*180/PI()),IF(L18=2,(270+ATAN(ABS(G18)/ABS(H18))*180/PI()),\"ERROR\"))))","v":134.99999933298932},{"$f":"MAX(I18:I25)","v":6.0827625263939531},{"$f":"N18/H16","v":33.137437643787955},"cm/yr",{"$f":"I18/$H$16","v":7.7042976826522187},"A to B",{"$f":"(S12-S11)/S11","v":10.889245697428898},{"$f":"360-T11+T12","v":120.7429645714388},{"$f":"(U12-U11)/U11","v":10.922258757949294}]
[225,"2014-09-11",7146918.9000000004,512905.20500000002,null,{"$f":"A10","v":223},{"$f":"C11-C10","v":-2.0000000484287739E-2},{"$f":"D11-D10","v":3.0000000027939677E-2},3.6055513046521619,0,1,1,123.69006814168193,null,null,null,{"$f":"I19/$H$16","v":19.642182480567747},"B to C",{"$f":"(S13-S12)/S12","v":-0.86090004722545688},{"$f":"360-T13+T12","v":129.80557107203617},{"$f":"(U13-U12)/U12","v":-0.86662289526710223}]
[225,"2015-09-17",7146918.9160000002,512905.22700000001,null,{"$f":"A16","v":225},{"$f":"C17-C16","v":9.9999997764825821E-3},{"$f":"D17-D16","v":4.9999999988358468E-2},{"$f":"(G20^2+H20^2)^0.5*100","v":5.0990195080677019},{"$f":"IF(G20>0,2,0)","v":2},{"$f":"IF(H20>0,1,0)","v":1},{"$f":"SUM(J20:K20)","v":3},{"$f":"IF(L20=3,(ATAN(H20/G20)*180/PI()),IF(L20=1,(90+ATAN(ABS(G20)/ABS(H20))*180/PI()),IF(L20=0,(180+ATAN(ABS(H20)/ABS(G20))*180/PI()),IF(L20=2,(270+ATAN(ABS(G20)/ABS(H20))*180/PI()),\"ERROR\"))))","v":78.690067769695219},null,null,null,27.778240603652407,"C to D",{"$f":"(S14-S13)/S13","v":0.13243596287277651},{"$f":"360-T13+T14","v":100.2303036491635},{"$f":"(U14-U13)/U13","v":1.0192666743374876},null,"C to D",{"$f":"(T54-S13)/S13","v":-0.15844367261490097},{"$f":"360-T13+T55","v":92.970622315815234},{"$f":"U20","v":1.0192666743374876}]
[1195,"2003-08-20",7147111.9400000004,512899.53,null,{"$f":"A22","v":1195},{"$f":"C23-C22","v":-1.9999999552965164E-2},{"$f":"D23-D22","v":0},{"$f":"(G21^2+H21^2)^0.5*100","v":1.9999999552965164},{"$f":"IF(G21>0,2,0)","v":0},{"$f":"IF(H21>0,1,0)","v":0},{"$f":"SUM(J21:K21)","v":0},{"$f":"IF(L21=3,(ATAN(H21/G21)*180/PI()),IF(L21=1,(90+ATAN(ABS(G21)/ABS(H21))*180/PI()),IF(L21=0,(180+ATAN(ABS(H21)/ABS(G21))*180/PI()),IF(L21=2,(270+ATAN(ABS(G21)/ABS(H21))*180/PI()),\"ERROR\"))))","v":180},null,null,null,10.895522144525799,"D to E",{"$f":"(S15-S14)/S14","v":0.57548152367556582},{"$f":"T14-T15","v":36.473027542646342},{"$f":"(U15-U14)/U14","v":0.64474056507735678},null,"D to E",{"$f":"(T69-T54)/T54","v":789.01039180639111},{"$f":"T55-T70","v":{"$error":"#VALUE!"}},{"$f":"(T71-O49)/O49","v":316.76959422427836}]
[1195,"2010-07-20",7147112.0499999998,512899.52,null,{"$f":"A28","v":1834},{"$f":"C29-C28","v":-9.9999997764825821E-3},{"$f":"D29-D28","v":5.9999999997671694E-2},{"$f":"(G22^2+H22^2)^0.5*100","v":6.0827625263939531},{"$f":"IF(G22>0,2,0)","v":0},{"$f":"IF(H22>0,1,0)","v":1},{"$f":"SUM(J22:K22)","v":1},{"$f":"IF(L22=3,(ATAN(H22/G22)*180/PI()),IF(L22=1,(90+ATAN(ABS(G22)/ABS(H22))*180/PI()),IF(L22=0,(180+ATAN(ABS(H22)/ABS(G22))*180/PI()),IF(L22=2,(270+ATAN(ABS(G22)/ABS(H22))*180/PI()),\"ERROR\"))))","v":99.462322000711495},null,null,null,33.137437643787955]
[1195,"2010-09-25",7147112.0300000003,512899.52,null,"BH-4"]
[1195,"2012-08-06",7147112.0599999996,512899.52]
[1195,"2014-09-11",7147112.0860000001,512899.54800000001]
[1195,"2015-09-17",7147112.1119999997,512899.527]
[1834,"2003-08-20",7146973.6200000001,512893.43]
[1834,"2010-07-20",7146973.79,512893.34,null,null,null,null,null,null,null,null,null,null,null,null,null,null,"Upper Slope"]
[1834,"2010-09-25",7146973.7800000003,512893.4,null,null,{"$f":"SUM(G18:G25)","v":-4.9999999813735485E-2},{"$f":"SUM(H18:H25)","v":0.15000000002328306},{"$f":"AVERAGE(I18:I25)","v":3.6403093683273808},{"$f":"_xlfn.STDEV.S(I18:I22)","v":1.9837299715007326},null,null,null,"avg bearing",{"$f":"90+ATAN(ABS(G29)/H29)*180/PI()","v":108.43494875622095},null,null,{"$f":"B3","v":"2003-08-20"},{"$f":"S11","v":1.6680230702378269}]
[1834,"2012-08-06",7146973.8200000003,512893.36,null,null,null,null,{"$f":"I29/H16","v":19.831536111037224},"cm/yr",null,null,null,null,null,null,null,"2010-07-20",{"$f":"S11","v":1.6680230702378269}]
[1834,"2014-09-11",7146973.8569999998,512893.36099999998,null,null,null,null,null,null,null,null,null,null,null,null,null,"2010-07-20",{"$f":"S12","v":19.831536111037224}]
[1834,"2015-09-17",7146973.8700000001,512893.35800000001,null,"2010 to 2012",null,{"$f":"(B6-B5)/365","v":1.8657534246575342},"Upper",null,null,null,null,null,null,null,null,"2010-09-25",{"$f":"S12","v":19.831536111037224}]
["BH-4","2003-08-20","N/A","N/A",null,"Point","dN","dE","Movement","N/S","E/W","Quadrant","Azimuth","Max",null,null,null,"2010-09-25",{"$f":"S13","v":2.758565736491926}]
["BH-4","2010-07-20","N/A","N/A",null,{"$f":"A5","v":"81-1"},{"$f":"C6-C5","v":3.0000000260770321E-2},{"$f":"D6-D5","v":0},{"$f":"(G34^2+H34^2)^0.5*100","v":3.0000000260770321},{"$f":"IF(G34>0,2,0)","v":2},{"$f":"IF(H34>0,1,0)","v":0},{"$f":"SUM(J34:K34)","v":2},0,{"$f":"MAX(I34:I40)","v":8.2462112589152028},{"$f":"N34/H32","v":4.4197754911953728},"cm/yr",{"$f":"I34/$H$32","v":1.6079295293951787},"2012-08-06",{"$f":"S13","v":2.758565736491926}]
["BH-4","2010-09-25","N/A","N/A",null,{"$f":"A11","v":223},{"$f":"C12-C11","v":8.0000000074505806E-2},{"$f":"D12-D11","v":-2.0000000018626451E-2},8.2462112589152028,2,0,2,{"$f":"IF(L35=3,(ATAN(H35/G35)*180/PI()),IF(L35=1,(90+ATAN(ABS(G35)/ABS(H35))*180/PI()),IF(L35=0,(180+ATAN(ABS(H35)/ABS(G35))*180/PI()),IF(L35=2,(270+ATAN(ABS(G35)/ABS(H35))*180/PI()),\"ERROR\"))))","v":345.96375653207355},null,null,null,{"$f":"I35/$H$32","v":4.4197754911953728},"2012-08-06",{"$f":"S14","v":3.1238990459520841}]
["BH-4","2012-08-06",7146871.2869999995,513025.11300000001,null,{"$f":"A17","v":225},{"$f":"C18-C17","v":4.9999999813735485E-2},{"$f":"D18-D17","v":-2.9999999969732016E-2},5.8309518773159752,2,0,2,{"$f":"IF(L36=3,(ATAN(H36/G36)*180/PI()),IF(L36=1,(90+ATAN(ABS(G36)/ABS(H36))*180/PI()),IF(L36=0,(180+ATAN(ABS(H36)/ABS(G36))*180/PI()),IF(L36=2,(270+ATAN(ABS(G36)/ABS(H36))*180/PI()),\"ERROR\"))))","v":329.03624339926364},null,null,null,3.1252532088404275,"2014-09-11",{"$f":"S14","v":3.1238990459520841}]
["BH-4","2014-09-11",7146871.2690000003,513025.13799999998,null,{"$f":"A23","v":1195},{"$f":"C24-C23","v":2.9999999329447746E-2},{"$f":"D24-D23","v":0},2.9999999329447746,2,0,2,0,null,null,null,1.6079294794784769,"2014-09-11",{"$f":"S38","v":4.9216452287252359}]
["BH-4","2015-09-17",7146871.2589999996,513025.12099999998,null,{"$f":"A29","v":1834},{"$f":"C30-C29","v":4.0000000037252903E-2},{"$f":"D30-D29","v":-4.0000000037252903E-2},5.6568542547607361,2,0,2,{"$f":"IF(L38=3,(ATAN(H38/G38)*180/PI()),IF(L38=1,(90+ATAN(ABS(G38)/ABS(H38))*180/PI()),IF(L38=0,(180+ATAN(ABS(H38)/ABS(G38))*180/PI()),IF(L38=2,(270+ATAN(ABS(G38)/ABS(H38))*180/PI()),\"ERROR\"))))","v":315},null,null,null,3.0319409735501743,"2015-09-17",{"$f":"S15","v":4.9216452287252359}]
[2836,"2003-08-20","N/A","N/A"]
[2836,"2010-07-20","N/A","N/A"]
[2836,"2010-09-25","N/A","N/A"]
[2836,"2012-08-06",7146814.7120000003,513092.91899999999]
[2836,"2014-09-11",7146814.7439999999,513093.054]
[2836,"2015-09-17",7146814.7759999996,513093.16899999999,null,null,{"$f":"SUM(G34:G40)","v":0.22999999951571226},{"$f":"SUM(H34:H40)","v":-9.0000000025611371E-2},{"$f":"AVERAGE(I34:I40)","v":5.1468034700027445},{"$f":"_xlfn.STDEV.S(I34:I38)","v":2.2108861312722898},null,null,null,"avg bearing",{"$f":"270+ATAN(G44/ABS(H44))*180/PI()","v":338.62937768418476}]
[186,"2003-08-20","N/A","N/A",null,null,null,null,{"$f":"I44/H32","v":2.758565736491926},"cm/yr"]
[186,"2010-07-20","N/A","N/A",null,null,null,null,null,null,null,null,null,null,null,null,null,null,null,7146814.7759999996,513093.16899999999,{"$f":"T47-T46","v":3.7300000004470348},null,{"$f":"U47-U46","v":-4.3090000000083819}]
[186,"2010-09-25","N/A","N/A",null,"2012 to 2014",null,{"$f":"(B7-B6)/365","v":2.0986301369863014},"Upper",null,null,null,null,null,null,null,null,null,null,7146818.5060000001,513088.86]
[186,"2012-08-06",7146818.4869999997,513088.61900000001,null,"Point","dN","dE","Movement","N/S","E/W","Quadrant","Azimuth","Max",null,null,null,null,null,null,null,"Diff"]
[186,"2014-09-11",7146818.5089999996,513088.80499999999,null,{"$f":"A6","v":"81-1"},{"$f":"C7-C6","v":-1.6999999992549419E-2},{"$f":"D7-D6","v":2.3999999975785613E-2},{"$f":"(G49^2+H49^2)^0.5*100","v":2.9410882315639384},{"$f":"IF(G49>0,2,0)","v":0},{"$f":"IF(H49>0,1,0)","v":1},{"$f":"SUM(J49:K49)","v":1},{"$f":"IF(L49=3,(ATAN(H49/G49)*180/PI()),IF(L49=1,(90+ATAN(ABS(G49)/ABS(H49))*180/PI()),IF(L49=0,(180+ATAN(ABS(H49)/ABS(G49))*180/PI()),IF(L49=2,(270+ATAN(ABS(G49)/ABS(H49))*180/PI()),\"ERROR\"))))","v":125.31121345505541},{"$f":"MAX(I49:L58)","v":18.729655626813983},{"$f":"N49/H47","v":8.9247053574244166},"cm/yr",{"$f":"I49/$H$47","v":1.4014323818809888},"Average W/O BH-4",null,{"$f":"AVERAGE(I49:I53,I55:I58)","v":6.9420558350375359},{"$f":"I54","v":3.0805843120401639},{"$f":"ABS(T49-U49)","v":3.861471522997372}]
[186,"2015-09-17",7146818.5060000001,513088.86,null,{"$f":"A12","v":223},{"$f":"C13-C12","v":2.0999999716877937E-2},{"$f":"D13-D12","v":2.7000000001862645E-2},3.4205262580624294,2,1,3,52.125016725164222,null,null,null,{"$f":"I50/$H$47","v":1.6298852274057267},"Average W/O BH-4 Cable",null,{"$f":"AVERAGE(I49:I57)","v":5.8721823922682432},{"$f":"I58","v":12.709445296963789},{"$f":"ABS(T50-U50)","v":6.837262904695546}]
[300,"2003-08-20","N/A","N/A",null,{"$f":"A18","v":225},{"$f":"C19-C18","v":1.0000000707805157E-2},{"$f":"D19-D18","v":-5.0000000046566129E-3},1.1180340522661631,2,0,2,333.43495042374752,null,null,null,0.53274468547930753,"Average W/O 186",null,{"$f":"AVERAGE(I49:I55,I57:I58)","v":5.2032701333959999},{"$f":"I56","v":18.729655626813983},{"$f":"ABS(T51-U51)","v":13.526385493417983}]
[300,"2010-07-20","N/A","N/A",null,{"$f":"A24","v":1195},{"$f":"C25-C24","v":2.6000000536441803E-2},{"$f":"D25-D24","v":2.7999999991152436E-2},3.8209946707624578,2,1,3,47.121095798179297,null,null,null,1.8207089488620065,"Average W/O 2836",null,{"$f":"AVERAGE(I49:I54,I56:I58)","v":5.7427789209478242},{"$f":"I55","v":13.874076538847572},{"$f":"ABS(T52-U52)","v":8.1312976178997474}]
[300,"2010-09-25","N/A","N/A",null,{"$f":"A30","v":1834},{"$f":"C31-C30","v":3.6999999545514584E-2},{"$f":"D31-D30","v":9.9999998928979039E-4},3.7013510592034624,2,1,3,1.5481577014123133,null,null,null,1.7636986117614408]
[300,"2012-08-06",7146927.5559999999,513026.96399999998,null,{"$f":"A36","v":"BH-4"},{"$f":"C37-C36","v":-1.7999999225139618E-2},{"$f":"D37-D36","v":2.4999999965075403E-2},{"$f":"(G54^2+H54^2)^0.5*100","v":3.0805843120401639},{"$f":"IF(G54>0,2,0)","v":0},{"$f":"IF(H54>0,1,0)","v":1},{"$f":"SUM(J54:K54)","v":1},125.75388612283803,null,null,null,1.467902446337676,"Average w/o BH-4 Cable and 2836",null,{"$f":"AVERAGE(I49:I54,I56:I57)/H47","v":2.3214884500525161}]
[300,"2014-09-11",7146927.574,513026.97600000002,null,{"$f":"A42","v":2836},{"$f":"C43-C42","v":3.1999999657273293E-2},{"$f":"D43-D42","v":0.13500000000931323},{"$f":"(G55^2+H55^2)^0.5*100","v":13.874076538847572},2,1,3,76.664893797560921,null,null,null,6.6110155831323283,"Average bearing",null,71.599999999999994]
[300,"2015-09-17",7146927.6119999997,513026.95899999997,null,{"$f":"A48","v":186},{"$f":"C49-C48","v":2.199999988079071E-2},{"$f":"D49-D48","v":0.18599999998696148},{"$f":"(G56^2+H56^2)^0.5*100","v":18.729655626813983},2,1,3,83.254420388263483,null,null,null,8.9247053574244166]
["BH-4 Cable","2012-08-06",7146871.3269999996,513025.21500000003,null,{"$f":"A54","v":300},{"$f":"C55-C54","v":1.8000000156462193E-2},{"$f":"D55-D54","v":1.2000000046100467E-2},{"$f":"(G57^2+H57^2)^0.5*100","v":2.1633307808540287},2,1,3,33.690067397708503,null,null,null,1.0308299412685646]
["BH-4 Cable","2014-09-11",7146871.2599999998,513025.10700000002,null,"BH-4 Cable",{"$f":"C58-C57","v":-6.6999999806284904E-2},{"$f":"D58-D57","v":-0.10800000000745058},{"$f":"(G58^2+H58^2)^0.5*100","v":12.709445296963789},{"$f":"IF(G58>0,2,0)","v":0},{"$f":"IF(H58>0,1,0)","v":0},{"$f":"SUM(J58:K58)","v":0},238.18576137816737,null,null,null,6.0560672759683847]
["BH-4 Cable","2015-09-17",7146871.3660000004,513025.212,null,null,{"$f":"SUM(G49:G58)","v":6.4000001177191734E-2},{"$f":"SUM(H49:H58)","v":0.32499999995343387},{"$f":"AVERAGE(I49:I58)","v":6.5559086827377984},{"$f":"_xlfn.STDEV.S(I49:I58)","v":6.1381377253274918},null,null,null,"avg bearing",{"$f":"ATAN(H59/G59)*180/PI()","v":78.859681333348263}]
[null,null,null,null,null,null,null,null,{"$f":"I59/H47","v":3.1238990459520841},"cm/yr"]
[]
[null,null,null,null,null,"2014 to 2015",null,{"$f":"(B8-B7)/365","v":1.0164383561643835},"Upper"]
[null,null,null,null,null,"Point","dN","dE","Movement","N/S","E/W","Quadrant","Azimuth","Max",null,null,null,null,null,"2012 to 2014",null,2.0986301369863014,"Upper"]
[null,null,null,null,null,{"$f":"A8","v":"81-1"},{"$f":"C8-C7","v":6.9999992847442627E-3},{"$f":"D8-D7","v":7.0000000414438546E-3},{"$f":"(G64^2+H64^2)^0.5*100","v":0.98994944601547286},{"$f":"IF(G64>0,2,0)","v":2},{"$f":"IF(H64>0,1,0)","v":1},{"$f":"SUM(J64:K64)","v":3},{"$f":"IF(L64=3,(ATAN(H64/G64)*180/PI()),IF(L64=1,(90+ATAN(ABS(G64)/ABS(H64))*180/PI()),IF(L64=0,(180+ATAN(ABS(H64)/ABS(G64))*180/PI()),IF(L64=2,(270+ATAN(ABS(G64)/ABS(H64))*180/PI()),\"ERROR\"))))","v":45.000003096835364},{"$f":"MAX(I64:L73)","v":14.920120685037819},{"$f":"N64/H62","v":14.678824932719149},"cm/yr",null,null,null,"Point","dN","dE","Movement","N/S","E/W","Quadrant","Azimuth","Max",null,null,null,null,"Upper Slope","Std Dev","Control Limit"]
[null,null,null,null,null,{"$f":"A14","v":223},{"$f":"C14-C13","v":2.7000000700354576E-2},{"$f":"D14-D13","v":-1.6000000003259629E-2},3.1384710257121315,2,0,2,{"$f":"IF(L65=3,(ATAN(H65/G65)*180/PI()),IF(L65=1,(90+ATAN(ABS(G65)/ABS(H65))*180/PI()),IF(L65=0,(180+ATAN(ABS(H65)/ABS(G65))*180/PI()),IF(L65=2,(270+ATAN(ABS(G65)/ABS(H65))*180/PI()),\"ERROR\"))))","v":329.34933268964272},null,null,null,null,null,null,"81-1",-1.6999999992549419E-2,2.3999999975785613E-2,2.9410882315639384,0,1,1,125.31121345505541,{"$f":"MAX(W65:Z74)","v":18.729655626813983},{"$f":"AB65/V63","v":8.9247053574244166},{"$f":"W65/$V$63","v":1.4014323818809888},null,{"$f":"B3","v":"2003-08-20"},{"$f":"S29","v":1.6680230702378269},{"$f":"_xlfn.STDEV.S(Q3:Q7)","v":0.90447247575939871},{"$f":"AG65+AH65","v":2.5724955459972256}]
[null,null,null,null,null,{"$f":"A20","v":225},{"$f":"C20-C19","v":1.5999999828636646E-2},{"$f":"D20-D19","v":2.1999999997206032E-2},2.7202940914420228,2,1,3,53.972626903333442,null,null,null,null,null,null,223,2.0999999716877937E-2,2.7000000001862645E-2,3.4205262580624294,2,1,3,52.125016725164222,null,null,{"$f":"W66/$V$63","v":1.6298852274057267},null,"2010-07-20",{"$f":"S30","v":1.6680230702378269},{"$f":"AH65","v":0.90447247575939871},{"$f":"AG66+AH66","v":2.5724955459972256}]
[null,null,null,null,null,{"$f":"A26","v":1195},{"$f":"C26-C25","v":2.5999999605119228E-2},{"$f":"D26-D25","v":-2.1000000007916242E-2},3.3421549631916867,2,0,2,321.07245597129207,null,null,null,null,null,null,225,1.0000000707805157E-2,-5.0000000046566129E-3,1.1180340522661631,2,0,2,333.43495042374752,null,null,0.53274468547930753,null,"2010-07-20",19.831536111037224,{"$f":"_xlfn.STDEV.S(Q18:Q22)","v":10.806887158175634},30.638423269212858]
[null,null,null,null,null,{"$f":"A32","v":1834},{"$f":"C32-C31","v":1.3000000268220901E-2},{"$f":"D32-D31","v":-2.9999999678693712E-3},1.3341664318253541,2,0,2,347.00538360154485,null,null,null,null,null,null,1195,2.6000000536441803E-2,2.7999999991152436E-2,3.8209946707624578,2,1,3,47.121095798179297,null,null,1.8207089488620065,null,"2010-09-25",19.831536111037224,{"$f":"AH67","v":10.806887158175634},30.638423269212858]
[null,null,null,null,null,{"$f":"A37","v":"BH-4"},{"$f":"C38-C37","v":-1.0000000707805157E-2},{"$f":"D38-D37","v":-1.6999999992549419E-2},{"$f":"(G69^2+H69^2)^0.5*100","v":1.9723083275765578},0,0,0,239.53445329727259,null,null,null,null,null,null,1834,3.6999999545514584E-2,9.9999998928979039E-4,3.7013510592034624,2,1,3,1.5481577014123133,null,null,1.7636986117614408,null,"2010-09-25",2.758565736491926,{"$f":"_xlfn.STDEV.S(Q34:Q38)","v":1.1849830219007125},3.9435487583926383]
[null,null,null,null,null,{"$f":"A43","v":2836},{"$f":"C44-C43","v":3.1999999657273293E-2},{"$f":"D44-D43","v":0.11499999999068677},{"$f":"(G70^2+H70^2)^0.5*100","v":11.936917514971547},2,1,3,74.450195987583541,null,null,null,null,null,null,"BH-4",-1.7999999225139618E-2,2.4999999965075403E-2,3.0805843120401639,0,1,1,125.75388612283803,null,null,1.467902446337676,null,"2012-08-06",2.758565736491926,{"$f":"AH69","v":1.1849830219007125},3.9435487583926383]
[null,null,null,null,null,{"$f":"A49","v":186},{"$f":"C50-C49","v":-2.9999995604157448E-3},{"$f":"D50-D49","v":5.4999999993015081E-2},{"$f":"(G71^2+H71^2)^0.5*100","v":5.5081757384765364},0,1,1,93.122130005936697,null,null,null,null,null,null,2836,3.1999999657273293E-2,0.13500000000931323,13.874076538847572,2,1,3,76.664893797560921,null,null,6.6110155831323283,null,"2012-08-06",{"$f":"W76","v":2.7981025759502725},{"$f":"_xlfn.STDEV.S(AD65:AD73)","v":2.9034205653027683},5.7015231412530412]
[null,null,null,null,null,{"$f":"A55","v":300},{"$f":"C56-C55","v":3.7999999709427357E-2},{"$f":"D56-D55","v":-1.700000005075708E-2},{"$f":"(G72^2+H72^2)^0.5*100","v":4.1629316348484755},2,0,2,335.89776527175502,null,null,null,null,null,null,186,2.199999988079071E-2,0.18599999998696148,18.729655626813983,2,1,3,83.254420388263483,null,null,8.9247053574244166,null,"2014-09-11",{"$f":"W76","v":2.7981025759502725},{"$f":"AH71","v":2.9034205653027683},5.7015231412530412]
[null,null,null,null,null,"BH-4 Cable",{"$f":"C59-C58","v":0.10600000061094761},{"$f":"D59-D58","v":0.10499999998137355},{"$f":"(G73^2+H73^2)^0.5*100","v":14.920120685037819},{"$f":"IF(G73>0,2,0)","v":2},{"$f":"IF(H73>0,1,0)","v":1},{"$f":"SUM(J73:K73)","v":3},44.728457884124538,null,null,null,null,null,null,300,1.8000000156462193E-2,1.2000000046100467E-2,2.1633307808540287,2,1,3,33.690067397708503,null,null,1.0308299412685646,null,"2014-09-11",{"$f":"W91","v":3.8375141505036909},{"$f":"_xlfn.STDEV.S(AD80:AD88)","v":3.2685089792692867},7.1060231297729777]
[null,null,null,null,null,null,{"$f":"SUM(G64:G73)","v":0.25199999939650297},{"$f":"SUM(H64:H73)","v":0.22999999998137355},{"$f":"AVERAGE(I64:I73)","v":5.00254898590976},{"$f":"_xlfn.STDEV.S(I64:I73)","v":4.685498164515268},null,null,null,"avg bearing",{"$f":"ATAN(H74/G74)*180/PI()","v":42.386653790701921},null,null,null,null,null,null,null,null,null,null,null,null,null,null,null,null,"2015-09-17",{"$f":"W91","v":3.8375141505036909},{"$f":"AH73","v":3.2685089792692867},7.1060231297729777]
[null,null,null,null,null,null,null,null,{"$f":"I74/H62","v":4.9216452287252359},"cm/yr",null,null,null,null,null,null,null,null,null,null,{"$f":"SUM(U65:U74)","v":0.13100000098347664},{"$f":"SUM(V65:V74)","v":0.43299999996088445},{"$f":"AVERAGE(W65:W74)","v":5.8721823922682432},{"$f":"_xlfn.STDEV.S(W65:W74)","v":6.0932058986901962},null,null,null,"avg bearing",{"$f":"ATAN(V75/U75)*180/PI()","v":73.167312402690598}]
[null,null,null,null,null,null,null,null,null,null,null,null,null,null,null,null,null,null,null,null,null,null,{"$f":"W75/V63","v":2.7981025759502725},"cm/yr",null,null,null,null,null,null,null,{"$f":"AF65","v":"2003-08-20"},null,null,{"$f":"_xlfn.STDEV.S(Q3:Q38,AD65:AD88)","v":7.6188093664031422}]
[null,null,null,null,null,null,null,null,null,null,null,null,null,null,null,null,null,null,null,null,null,null,null,null,null,null,null,null,null,null,null,"2015-09-17",null,null,{"$f":"AI76","v":7.6188093664031422}]
[null,null,null,null,null,null,null,null,null,null,null,null,null,null,null,null,null,null,null,"2014 to 2015",null,1.0164383561643835,"Upper"]
[null,null,null,null,null,null,null,null,null,null,null,null,null,null,null,null,null,null,null,"Point","dN","dE","Movement","N/S","E/W","Quadrant","Azimuth","Max"]
[null,null,null,null,null,null,null,null,null,null,null,null,null,null,null,null,null,null,null,"81-1",6.9999992847442627E-3,7.0000000414438546E-3,0.98994944601547286,2,1,3,45.000003096835364,{"$f":"MAX(W80:Z89)","v":11.936917514971547},{"$f":"AB80/V78","v":11.743867636023221},{"$f":"W80/$V$78","v":0.97393948192896929},null,{"$f":"(AG71-AG70)/AG70","v":1.4332389812332509E-2}]
[null,null,null,null,null,null,null,null,null,null,null,null,null,null,null,null,null,null,null,223,2.7000000700354576E-2,-1.6000000003259629E-2,3.1384710257121315,2,0,2,329.34933268964272,null,null,{"$f":"W81/$V$78","v":3.0877140819000757}]
[null,null,null,null,null,null,null,null,null,null,null,null,null,null,null,null,null,null,null,225,1.5999999828636646E-2,2.1999999997206032E-2,2.7202940914420228,2,1,3,53.972626903333442,null,null,2.6763001169173544]
[null,null,null,null,null,null,null,null,null,null,null,null,null,null,null,null,null,null,null,1195,2.5999999605119228E-2,-2.1000000007916242E-2,3.3421549631916867,2,0,2,321.07245597129207,null,null,3.2881039395282095]
[null,null,null,null,null,null,null,null,null,null,null,null,null,null,null,null,null,null,null,1834,1.3000000268220901E-2,-2.9999999678693712E-3,1.3341664318253541,2,0,2,347.00538360154485,null,null,1.3125896162163189]
[null,null,null,null,null,null,null,null,null,null,null,null,null,null,null,null,null,null,null,"BH-4",-1.0000000707805157E-2,-1.6999999992549419E-2,1.9723083275765578,0,0,0,239.53445329727259,null,null,1.9404111578583387]
[null,null,null,null,null,null,null,null,null,null,null,null,null,null,null,null,null,null,null,2836,3.1999999657273293E-2,0.11499999999068677,11.936917514971547,2,1,3,74.450195987583541,null,null,11.743867636023221,null,null,null,null,{"$f":"(5.7-3.3)/3.3","v":0.7272727272727274}]
[null,null,null,null,null,null,null,null,null,null,null,null,null,null,null,null,null,null,null,186,-2.9999995604157448E-3,5.4999999993015081E-2,5.5081757384765364,0,1,1,93.122130005936697,null,null,5.419094729228938]
[null,null,null,null,null,null,null,null,null,null,null,null,null,null,null,null,null,null,null,300,3.7999999709427357E-2,-1.700000005075708E-2,4.1629316348484755,2,0,2,335.89776527175502,null,null,4.0956065949317892]
[null,null,null,null,null,null,null,null,null,null,null,null,null,null,null,null,null,null,null,null,null,null,null,null,null,null,null,null,null,null,null,{"$f":"AVERAGE(AF65:AF66)","v":"2007-02-03"},{"$f":"AG65","v":1.6680230702378269},null,{"$f":"AI76","v":7.6188093664031422}]
[null,null,null,null,null,null,null,null,null,null,null,null,null,null,null,null,null,null,null,null,{"$f":"SUM(U80:U89)","v":0.14599999878555536},{"$f":"SUM(V80:V89)","v":0.125},{"$f":"AVERAGE(W80:W89)","v":3.9005965748955322},{"$f":"_xlfn.STDEV.S(W80:W89)","v":3.3222378939969999},null,null,null,"avg bearing",{"$f":"ATAN(V90/U90)*180/PI()","v":40.56896092253811},null,null,{"$f":"AVERAGE(AF67:AF68)","v":"2010-08-22T12:00:00"},{"$f":"AG67","v":19.831536111037224},null,{"$f":"AI89","v":7.6188093664031422}]
[null,null,null,null,null,null,null,null,null,null,null,null,null,null,null,null,null,null,null,null,null,null,{"$f":"W90/V78","v":3.8375141505036909},"cm/yr",null,null,null,null,null,null,null,{"$f":"AVERAGE(AF69:AF70)","v":"2011-08-31T12:00:00"},{"$f":"AG69","v":2.758565736491926},null,{"$f":"AI90","v":7.6188093664031422}]
[null,null,null,null,null,null,null,null,null,null,null,null,null,null,null,null,null,null,null,null,null,null,null,null,null,null,null,null,null,null,null,{"$f":"AVERAGE(AF71:AF72)","v":"2013-08-24"},{"$f":"AG71","v":2.7981025759502725},null,7.6188093664031422]
[null,null,null,null,null,null,null,null,null,null,null,null,null,null,null,null,null,null,null,null,null,null,null,null,null,null,null,null,null,null,null,{"$f":"AVERAGE(AF73:AF74)","v":"2015-03-15T12:00:00"},{"$f":"AG73","v":3.8375141505036909},null,7.6188093664031422]
[null,null,null,null,null,null,null,null,null,null,null,null,null,null,null,null,null,null,null,null,null,null,null,null,{"$f":"_xlfn.STDEV.S(AD80:AD88)","v":3.2685089792692867}]
[null,null,null,null,null,null,null,null,null,null,null,null,null,null,null,null,null,null,null,null,null,null,null,null,null,null,{"$f":"(8.92-4.42)/4.42","v":1.0180995475113122}]
[null,null,null,null,null,null,null,null,null,null,null,null,null,null,null,null,null,null,null,null,null,null,null,null,null,null,{"$f":"(11.7-8.92)/8.92","v":0.31165919282511206}]
[]
[null,null,null,null,null,null,null,null,null,null,null,null,null,null,null,null,null,null,null,"Elevation Change"]
[null,null,null,null,null,null,null,null,null,null,null,null,null,null,null,null,null,null,null,"Point",2012,2014,2015,"2012-2014","2014-2015"]
[null,null,null,null,null,null,null,null,null,null,null,null,null,null,null,null,null,null,null,2836,477.53199999999998,477.32,477.30900000000003,{"$f":"V100-U100","v":-0.21199999999998909},{"$f":"W100-V100","v":-1.0999999999967258E-2}]
[null,null,null,null,null,null,null,null,null,null,null,null,null,null,null,null,null,null,null,186,477.65800000000002,477.50400000000002,477.44499999999999,{"$f":"V101-U101","v":-0.15399999999999636},-5.9000000000025921E-2,null,null,null,null,null,null,{"$f":"_xlfn.STDEV.S(AD65:AD88,Q3:Q7,Q34:Q38)","v":2.5637825149561855}]
[null,null,null,null,null,null,null,null,null,null,null,null,null,null,null,null,null,null,null,"BH-4",470.97899999999998,470.96300000000002,470.98899999999998,-1.5999999999962711E-2,2.5999999999953616E-2]
[null,null,null,null,null,null,null,null,null,null,null,null,null,null,null,null,null,null,null,"BH-4 Cable",470.96,470.96,470.95299999999997,0,-7.0000000000050022E-3]

{"sheet":"Wolverine Movement","index":2,"n_rows":196,"n_cols":38,"rows_kept":196,"cut":false,"hidden":false,"merged":[[221,0,221,3],[0,0,0,3],[97,0,97,3],[145,0,145,3],[158,0,158,3],[171,19,171,20],[171,21,171,22],[171,23,171,24],[8,19,8,20],[8,21,8,22],[8,23,8,24],[17,19,17,20],[17,21,17,22],[17,23,17,24]]}
["North Upper",null,null,null,null,"2003 to 2010",null,{"$f":"(B4-B3)/365","v":6.9178082191780819},null,"North Upper"]
["Monitor","Date","Northing\n(m)","Easting\n(m)","Elevation","Point","dN","dE","dz","Movement","N/S","E/W","Quadrant","Azimuth","Max"]
[1483,"2003-08-21",7148233.0099999998,513412.67,609.08000000000004,{"$f":"A3","v":1483},{"$f":"C4-C3","v":3.0000000260770321E-2},{"$f":"D4-D3","v":4.0000000037252903E-2},{"$f":"E4-E3","v":-0.18000000000006366},{"$f":"(G3^2+H3^2)^0.5*100","v":5.0000000186264515},{"$f":"IF(G3>0,2,0)","v":2},{"$f":"IF(H3>0,1,0)","v":1},{"$f":"SUM(K3:L3)","v":3},{"$f":"IF(M3=3,(ATAN(H3/G3)*180/PI()),IF(M3=1,(90+ATAN(ABS(G3)/ABS(H3))*180/PI()),IF(M3=0,(180+ATAN(ABS(H3)/ABS(G3))*180/PI()),IF(M3=2,(270+ATAN(ABS(G3)/ABS(H3))*180/PI()),\"ERROR\"))))","v":53.130102140712573},{"$f":"MAX(J3:J10)","v":34.234485540226238},{"$f":"O3/H1","v":4.9487474147257737},{"$f":"J3/$H$1","v":0.72277227992025939}]
[1483,"2010-07-20",7148233.04,513412.71,608.9,{"$f":"A9","v":26},{"$f":"C10-C9","v":4.0000000037252903E-2},{"$f":"D10-D9","v":8.999999996740371E-2},{"$f":"E10-E9","v":-0.10000000000002274},9.8488578003304017,2,1,3,66.037510997916215,null,null,{"$f":"J4/$H$1","v":1.423696276087365}]
[1483,"2010-09-25",7148233.0499999998,513412.74,608.87,{"$f":"A15","v":"80-2"},{"$f":"C16-C15","v":4.0000000037252903E-2},{"$f":"D16-D15","v":0.34000000002561137},{"$f":"E16-E15","v":-0.40999999999996817},34.234485540226238,2,1,3,83.290163186551865,null,null,4.9487474147257737]
[1483,"2012-08-06",7148233.0599999996,513412.77,608.79,{"$f":"A21","v":"26-A"},{"$f":"C22-C21","v":6.0000000521540642E-2},{"$f":"D22-D21","v":7.0000000006984919E-2},{"$f":"E22-E21","v":-0.21000000000003638},9.219544491764637,2,1,3,49.398705111732824,null,null,1.332726233463007]
[1483,"2014-09-13",7148233.0539999995,513412.78100000002,608.71900000000005,{"$f":"A27","v":"80-1"},{"$f":"C28-C27","v":4.9999999813735485E-2},{"$f":"D28-D27","v":0.20000000001164153},{"$f":"E28-E27","v":-0.2800000000000864},20.61552812470012,2,1,3,75.963756583080226,null,null,2.9800664417883342,null,"North"]
[1483,"2015-09-17",7148233.0779999997,513412.78899999999,608.69500000000005,null,null,null,null,null,null,null,null,null,null,null,0]
[26,"2003-08-21",7148341.4500000002,513483.53,575.11,{"$f":"A33","v":"BH-14"},{"$f":"C34-C33","v":0},{"$f":"D34-D33","v":-0.13000000000465661},null,13.000000000465661,0,0,0,270,null,null,1.8792079208593928,null,null,"Upper",null,null,null,null,null,null,null,null,null,null,null,null,null,"TP-A","TP-B","TP-C","TP-D","TP-E"]
[26,"2010-07-20",7148341.4900000002,513483.62,575.01,{"$f":"A39","v":1495},{"$f":"C40-C39","v":0.12000000011175871},{"$f":"D40-D39","v":0.17999999999301508},{"$f":"E40-E39","v":0},21.633307658402011,2,1,3,56.309932448365963,null,null,3.1271910080462315,null,null,"Avg","Azimuth",null,null,null,null,null,null,null,null,null,null,null,"Upper",{"$f":"T11","v":2.3449153678414807},{"$f":"T12","v":16.392565729174077},{"$f":"T13","v":2.7333117516644161},{"$f":"T15","v":4.078789883232198}]
[26,"2010-09-25",7148341.4900000002,513483.66,574.97,null,{"$f":"SUM(G3:G10)","v":0.34000000078231096},{"$f":"SUM(H3:H10)","v":0.7900000000372529},{"$f":"AVERAGE(I3:I10)","v":-0.19666666666669622},{"$f":"AVERAGE(J3:J10)","v":16.221674804930789},null,null,null,null,"avg bearing",{"$f":"ATAN(H11/G11)*180/PI()","v":66.713935034886404},null,null,"TP-A",{"$f":"J12","v":2.3449153678414807},{"$f":"P11","v":66.713935034886404}]
[26,"2012-08-06",7148341.5300000003,513483.69,574.91,null,null,null,{"$f":"I11/H1","v":-2.8429042904294703E-2},{"$f":"J11/H1","v":2.3449153678414807},"cm/yr",null,null,null,null,null,null,null,"TP-B",{"$f":"J25","v":16.392565729174077},{"$f":"P24","v":87.137595103235157},{"$f":"(T12-T11)/T11","v":5.9906854439116097},{"$f":"U12-U11","v":20.423660068348752}]
[26,"2014-09-13",7148341.5149999997,513483.72200000001,574.90700000000004,"2010 to 2010",null,{"$f":"(B5-B4)/365","v":0.18356164383561643},null,"North Upper",null,null,null,null,null,null,null,null,"TP-C",{"$f":"J40","v":2.7333117516644161},{"$f":"P39","v":64.230672283038786},{"$f":"(T13-T12)/T12","v":-0.83325906408903982},{"$f":"U12-U13","v":22.906922820196371},null,null,null,{"$f":"(3.8-2.73)/2.73","v":0.39194139194139188}]
[26,"2015-09-17",7148341.5580000002,513483.72899999999,574.83399999999995]
["80-2","2003-08-21",7148290.0499999998,513549.41,552.78,"Point","dN","dE","dz","Movement","N/S","E/W","Quadrant","Azimuth","Max",null,null,null,"TP-D",{"$f":"J51","v":4.078789883232198},{"$f":"P50","v":80.213874771396874},{"$f":"(T15-T13)/T13","v":0.49225198360504241},{"$f":"U15-U13","v":15.983202488358089},null,null,null,null,null,null,null,null,null,"Mid",{"$f":"W11","v":0},{"$f":"W12","v":20.423660068348752},{"$f":"W13","v":22.906922820196371},{"$f":"W15","v":15.983202488358089}]
["80-2","2010-07-20",7148290.0899999999,513549.75,552.37,{"$f":"A4","v":1483},{"$f":"C5-C4","v":9.9999997764825821E-3},{"$f":"D5-D4","v":2.9999999969732016E-2},{"$f":"E5-E4","v":-2.9999999999972715E-2},{"$f":"(G16^2+H16^2)^0.5*100","v":3.1622776502286647},{"$f":"IF(G16>0,2,0)","v":2},{"$f":"IF(H16>0,1,0)","v":1},{"$f":"SUM(K16:L16)","v":3},{"$f":"IF(M16=3,(ATAN(H16/G16)*180/PI()),IF(M16=1,(90+ATAN(ABS(G16)/ABS(H16))*180/PI()),IF(M16=0,(180+ATAN(ABS(H16)/ABS(G16))*180/PI()),IF(M16=2,(270+ATAN(ABS(G16)/ABS(H16))*180/PI()),\"ERROR\"))))","v":71.565051543933862},{"$f":"MAX(J16:J23)","v":3.9999999979045242},{"$f":"O16/H13","v":21.791044764703752},{"$f":"J16/$H$13","v":17.227333467663623},null,"TP-E",{"$f":"J63","v":3.8252925665247908},{"$f":"P62","v":340.20112375202461},-6.2150128828535232E-2,{"$f":"360-U16+U15","v":100.01275101937226},null,null,null,null,null,null,null,null,null,"Lower",{"$f":"Y11","v":0},{"$f":"Y12","v":0},{"$f":"Y13","v":0},{"$f":"Y15","v":0}]
["80-2","2010-09-25",7148290.0800000001,513549.78,552.33000000000004,{"$f":"A10","v":26},{"$f":"C11-C10","v":0},{"$f":"D11-D10","v":3.9999999979045242E-2},{"$f":"E11-E10","v":-3.999999999996362E-2},3.9999999979045242,0,1,1,90,null,null,{"$f":"J17/$H$13","v":21.791044764703752},null,null,null,null,null,null,null,null,null,null,null,null,null,null,null,"RPC Upper",null,{"$f":"(AI10-AH10)/AH10","v":5.9906854439116097},{"$f":"(AJ10-AI10)/AI10","v":-0.83325906408903982},{"$f":"(AK10-AJ10)/AJ10","v":0.49225198360504241}]
["80-2","2012-08-06",7148290.0800000001,513549.88,552.23,{"$f":"A16","v":"80-2"},{"$f":"C17-C16","v":-9.9999997764825821E-3},{"$f":"D17-D16","v":3.0000000027939677E-2},{"$f":"E17-E16","v":-3.999999999996362E-2},3.1622776557507279,0,1,1,108.43494842271562,null,null,17.227333497746503,null,null,null,null,null,null,null,null,null,null,null,null,null,null,null,"RPC Mid",null,{"$f":"(AI11-AH11)/AH11","v":{"$error":"#DIV/0!"}},{"$f":"(AJ11-AI11)/AI11","v":{"$error":"#DIV/0!"}},{"$f":"(AK11-AJ11)/AJ11","v":{"$error":"#DIV/0!"}}]
["80-2","2014-09-13",7148290.0729999999,513550.02100000001,552.13800000000003,{"$f":"A22","v":"26-A"},{"$f":"C23-C22","v":-1.0000000707805157E-2},{"$f":"D23-D22","v":2.9999999969732016E-2},{"$f":"E23-E22","v":-9.9999999999909051E-3},3.1622776796796717,0,1,1,108.43495005689172,null,null,17.227333628105676,null,null,null,null,null,null,null,null,null,null,null,null,null,null,null,"RPC Lower",null,{"$f":"(AI12-AH12)/AH12","v":{"$error":"#DIV/0!"}},{"$f":"(AJ12-AI12)/AI12","v":{"$error":"#DIV/0!"}},{"$f":"(AK12-AJ12)/AJ12","v":{"$error":"#DIV/0!"}}]
["80-2","2015-09-17",7148290.108,513549.99300000002,552.07299999999998,null,null,null,null,null,null,null,null,null,null,null,0]
["26-A","2003-08-21",7148339.2999999998,513540.5,557.82000000000005,{"$f":"A28","v":"80-1"},{"$f":"C29-C28","v":9.9999997764825821E-3},{"$f":"D29-D28","v":3.0000000027939677E-2},{"$f":"E29-E28","v":-2.9999999999972715E-2},3.1622776557507279,2,1,3,71.565051577284393,null,null,17.227333497746503,null,null,null,null,null,null,null,null,null,null,null,null,null,null,null,"Upper",null,{"$f":"AI13-AH13","v":0},{"$f":"AJ13-AI13","v":0},0]
["26-A","2010-07-20",7148339.3600000003,513540.57,557.61,{"$f":"A34","v":"BH-14"},{"$f":"C35-C34","v":0},{"$f":"D35-D34","v":2.9999999969732016E-2},{"$f":"E35-E34","v":-2.9999999999972715E-2},2.9999999969732016,0,1,1,90,null,null,16.343283565600277,null,null,null,null,null,null,null,null,null,null,null,null,null,null,null,"Mid",null,{"$f":"AI15-AH15","v":20.423660068348752},2.4832627518476187,-6.9237203318382825]
["26-A","2010-09-25",7148339.3499999996,513540.6,557.6,{"$f":"A40","v":1495},{"$f":"C41-C40","v":9.9999997764825821E-3},{"$f":"D41-D40","v":1.0000000009313226E-2},{"$f":"E41-E40","v":-2.9999999999972715E-2},1.4142135472265716,2,1,3,45.000000667010674,null,null,7.7042976826522187,null,null,null,null,null,null,null,null,null,null,null,null,null,null,null,"Lower",null,{"$f":"AI16-AH16","v":0},0,0]
["26-A","2012-08-06",7148339.3700000001,513540.63,557.55999999999995,null,{"$f":"SUM(G16:G23)","v":9.9999988451600075E-3},{"$f":"SUM(H16:H23)","v":0.19999999995343387},{"$f":"AVERAGE(I16:I23)","v":-2.9999999999972715E-2},{"$f":"AVERAGE(J16:J23)","v":3.0090463119305837},null,null,null,null,"avg bearing",{"$f":"ATAN(H24/G24)*180/PI()","v":87.137595103235157}]
["26-A","2014-09-13",7148339.3389999997,513540.67200000002,557.529,null,null,null,{"$f":"I24/H13","v":-0.16343283582074689},{"$f":"J24/H13","v":16.392565729174077},"cm/yr"]
["26-A","2015-09-17",7148339.4000000004,513540.63299999997,557.50699999999995]
["80-1","2003-08-21",7148407.9800000004,513543.04,555.71]
["80-1","2010-07-20",7148408.0300000003,513543.24,555.42999999999995,"2010 to 2012",null,{"$f":"(B6-B5)/365","v":1.8657534246575342},null,"North Upper",null,null,null,null,null,null,null,null,null,"Upper Slope","Stdev","Avg + Stdev"]
["80-1","2010-09-25",7148408.04,513543.27,555.4,"Point","dN","dE","dz","Movement","N/S","E/W","Quadrant","Azimuth","Max",null,null,null,{"$f":"B3","v":"2003-08-21"},{"$f":"T11","v":2.3449153678414807},{"$f":"_xlfn.STDEV.S(Q3:Q10)","v":1.5733502038213725},{"$f":"T29+U29","v":3.9182655716628529}]
["80-1","2012-08-06",7148408.0700000003,513543.32,555.33000000000004,{"$f":"A5","v":1483},{"$f":"C6-C5","v":9.9999997764825821E-3},{"$f":"D6-D5","v":3.0000000027939677E-2},{"$f":"E6-E5","v":-8.0000000000040927E-2},{"$f":"(G30^2+H30^2)^0.5*100","v":3.1622776557507279},{"$f":"IF(G30>0,2,0)","v":2},{"$f":"IF(H30>0,1,0)","v":1},{"$f":"SUM(K30:L30)","v":3},{"$f":"IF(M30=3,(ATAN(H30/G30)*180/PI()),IF(M30=1,(90+ATAN(ABS(G30)/ABS(H30))*180/PI()),IF(M30=0,(180+ATAN(ABS(H30)/ABS(G30))*180/PI()),IF(M30=2,(270+ATAN(ABS(G30)/ABS(H30))*180/PI()),\"ERROR\"))))","v":71.565051577284393},{"$f":"MAX(J30:J37)","v":9.9999999976716936},{"$f":"O30/H28","v":5.3597650501470895},{"$f":"J30/$H$28","v":1.6949065262100085},null,"2010-07-20",{"$f":"T11","v":2.3449153678414807},{"$f":"U29","v":1.5733502038213725},{"$f":"T30+U30","v":3.9182655716628529}]
["80-1","2014-09-13",7148408.0590000004,513543.397,555.26300000000003,{"$f":"A11","v":26},{"$f":"C12-C11","v":4.0000000037252903E-2},{"$f":"D12-D11","v":3.0000000027939677E-2},{"$f":"E12-E11","v":-6.0000000000059117E-2},5.0000000046566129,2,1,3,{"$f":"IF(M31=3,(ATAN(H31/G31)*180/PI()),IF(M31=1,(90+ATAN(ABS(G31)/ABS(H31))*180/PI()),IF(M31=0,(180+ATAN(ABS(H31)/ABS(G31))*180/PI()),IF(M31=2,(270+ATAN(ABS(G31)/ABS(H31))*180/PI()),\"ERROR\"))))","v":36.86989764584402},null,null,{"$f":"J31/$H$28","v":2.6798825281933389},null,"2010-07-20",{"$f":"T12","v":16.392565729174077},{"$f":"_xlfn.STDEV.S(Q16:Q23)","v":6.9953662228368554},23.387931952010931]
["80-1","2015-09-17",7148408.0990000004,513543.37400000001,555.24900000000002,null,null,null,null,null,null,null,null,null,null,null,0,null,null,null,null,0]
["BH-14","2003-08-21",7148488.3600000003,513563.01,null,{"$f":"A17","v":"80-2"},{"$f":"C18-C17","v":0},{"$f":"D18-D17","v":9.9999999976716936E-2},{"$f":"E18-E17","v":-0.10000000000002274},9.9999999976716936,0,1,1,{"$f":"IF(M33=3,(ATAN(H33/G33)*180/PI()),IF(M33=1,(90+ATAN(ABS(G33)/ABS(H33))*180/PI()),IF(M33=0,(180+ATAN(ABS(H33)/ABS(G33))*180/PI()),IF(M33=2,(270+ATAN(ABS(G33)/ABS(H33))*180/PI()),\"ERROR\"))))","v":90},null,null,5.3597650501470895,null,"2010-09-25",{"$f":"T12","v":16.392565729174077},{"$f":"U31","v":6.9953662228368554},23.387931952010931]
["BH-14","2010-07-20",7148488.3600000003,513562.88,530.38,{"$f":"A23","v":"26-A"},{"$f":"C24-C23","v":2.0000000484287739E-2},{"$f":"D24-D23","v":3.0000000027939677E-2},{"$f":"E24-E23","v":-4.0000000000077307E-2},3.6055513046521619,2,1,3,{"$f":"IF(M34=3,(ATAN(H34/G34)*180/PI()),IF(M34=1,(90+ATAN(ABS(G34)/ABS(H34))*180/PI()),IF(M34=0,(180+ATAN(ABS(H34)/ABS(G34))*180/PI()),IF(M34=2,(270+ATAN(ABS(G34)/ABS(H34))*180/PI()),\"ERROR\"))))","v":56.309931858318066},null,null,1.932490787368633,null,"2010-09-25",{"$f":"T13","v":2.7333117516644161},{"$f":"_xlfn.STDEV.S(Q30:Q37)","v":1.5389204813276407},4.2722322329920566]
["BH-14","2010-09-25",7148488.3600000003,513562.91,530.35,{"$f":"A29","v":"80-1"},{"$f":"C30-C29","v":3.0000000260770321E-2},{"$f":"D30-D29","v":4.9999999988358468E-2},{"$f":"E30-E29","v":-6.9999999999936335E-2},5.8309519072635689,2,1,3,{"$f":"IF(M35=3,(ATAN(H35/G35)*180/PI()),IF(M35=1,(90+ATAN(ABS(G35)/ABS(H35))*180/PI()),IF(M35=0,(180+ATAN(ABS(H35)/ABS(G35))*180/PI()),IF(M35=2,(270+ATAN(ABS(G35)/ABS(H35))*180/PI()),\"ERROR\"))))","v":59.036243242319934},null,null,3.125253224891634,null,"2012-08-06",{"$f":"T13","v":2.7333117516644161},{"$f":"U34","v":1.5389204813276407},4.2722322329920566]
["BH-14","2012-08-06",7148488.3899999997,513562.91,530.33000000000004,{"$f":"A35","v":"BH-14"},{"$f":"C36-C35","v":2.9999999329447746E-2},{"$f":"D36-D35","v":0},{"$f":"E36-E35","v":-1.999999999998181E-2},2.9999999329447746,2,0,2,0,null,null,1.6079294794784769,null,"2012-08-06",{"$f":"T15","v":4.078789883232198},{"$f":"_xlfn.STDEV.S(Q43:Q50)","v":3.1681753841105191},7.2469652673427172]
["BH-14","2014-09-13",7148488.4780000001,513563.09600000002,530.31299999999999,{"$f":"A41","v":1495},{"$f":"C42-C41","v":1.0000000707805157E-2},{"$f":"D42-D41","v":4.9999999988358468E-2},{"$f":"E42-E41","v":-2.9999999999972715E-2},5.09901952633244,2,1,3,{"$f":"IF(M37=3,(ATAN(H37/G37)*180/PI()),IF(M37=1,(90+ATAN(ABS(G37)/ABS(H37))*180/PI()),IF(M37=0,(180+ATAN(ABS(H37)/ABS(G37))*180/PI()),IF(M37=2,(270+ATAN(ABS(G37)/ABS(H37))*180/PI()),\"ERROR\"))))","v":78.690066743524994},null,null,2.7329546653617336,null,"2014-09-11",{"$f":"T15","v":4.078789883232198},{"$f":"U36","v":3.1681753841105191},7.2469652673427172]
["BH-14","2015-09-17",7148488.5080000004,513563.09100000001,530.31500000000005,null,null,null,null,null,null,null,null,null,null,null,null,null,"2014-09-11",{"$f":"J63","v":3.8252925665247908},{"$f":"_xlfn.STDEV.S(Q55:Q61)","v":1.9944357902781067},5.8197283568028979]
[1495,"2003-08-21",7148526.5899999999,513528.92,529.05999999999995,null,{"$f":"SUM(G30:G37)","v":0.14000000059604645},{"$f":"SUM(H30:H37)","v":0.2900000000372529},{"$f":"AVERAGE(I31:I38)","v":-5.333333333334167E-2},{"$f":"AVERAGE(J30:J37)","v":5.0996857613245679},null,null,null,null,"avg bearing",{"$f":"ATAN(H39/G39)*180/PI()","v":64.230672283038786},null,null,{"$f":"B44","v":"2015-09-17"},{"$f":"T38","v":3.8252925665247908},{"$f":"U38","v":1.9944357902781067},5.8197283568028979]
[1495,"2010-07-20",7148526.71,513529.1,529.05999999999995,null,null,null,{"$f":"I39/H28","v":-2.8585413607444508E-2},{"$f":"J39/H28","v":2.7333117516644161},"cm/yr"]
[1495,"2010-09-25",7148526.7199999997,513529.11,529.03,"2012 to 2014",null,{"$f":"(B7-B6)/365","v":2.1041095890410957},null,"North Upper"]
[1495,"2012-08-06",7148526.7300000004,513529.16,529,"Point","dN","dE","dz","Movement","N/S","E/W","Quadrant","Azimuth","Max"]
[1495,"2014-09-13",7148526.801,513529.18699999998,529,{"$f":"A6","v":1483},{"$f":"C7-C6","v":-6.0000000521540642E-3},{"$f":"D7-D6","v":1.0999999998603016E-2},{"$f":"E7-E6","v":-7.0999999999912689E-2},{"$f":"(G43^2+H43^2)^0.5*100","v":1.2529964109889347},{"$f":"IF(G43>0,2,0)","v":0},{"$f":"IF(H43>0,1,0)","v":1},{"$f":"SUM(K43:L43)","v":1},{"$f":"IF(M43=3,(ATAN(H43/G43)*180/PI()),IF(M43=1,(90+ATAN(ABS(G43)/ABS(H43))*180/PI()),IF(M43=0,(180+ATAN(ABS(H43)/ABS(G43))*180/PI()),IF(M43=2,(270+ATAN(ABS(G43)/ABS(H43))*180/PI()),\"ERROR\"))))","v":118.61045987838899},{"$f":"MAX(J43:J49)","v":20.576685859679237},{"$f":"O43/H41","v":9.7792842952902639},{"$f":"J43/$H$41","v":0.59549959636843908},null,{"$f":"AVERAGE(S29:S30)","v":"2007-02-03T12:00:00"},{"$f":"T29","v":2.3449153678414807},{"$f":"_xlfn.STDEV.S(Q3:Q61)","v":5.9094262634978989}]
[1495,"2015-09-17",7148526.7929999996,513529.18599999999,528.976,{"$f":"A12","v":26},{"$f":"C13-C12","v":-1.5000000596046448E-2},{"$f":"D13-D12","v":3.2000000006519258E-2},{"$f":"E13-E12","v":-2.9999999999290594E-3},3.5341194353029812,0,1,1,115.11483575662284,null,null,{"$f":"J44/$H$41","v":1.6796270753718596},null,{"$f":"AVERAGE(S31:S33)","v":"2010-08-22T12:00:00"},{"$f":"T31","v":16.392565729174077},{"$f":"U43","v":5.9094262634978989}]
[null,null,null,null,null,{"$f":"A18","v":"80-2"},{"$f":"C19-C18","v":-7.0000002160668373E-3},{"$f":"D19-D18","v":0.14100000000325963},{"$f":"E19-E18","v":-9.1999999999984539E-2},14.117365194661554,0,1,1,92.842137971173628,null,null,6.7094248646503489,null,{"$f":"AVERAGE(S34:S35)","v":"2011-08-31T12:00:00"},{"$f":"T34","v":2.7333117516644161},{"$f":"U43","v":5.9094262634978989}]
[null,null,null,null,null,{"$f":"A24","v":"26-A"},{"$f":"C25-C24","v":-3.1000000424683094E-2},{"$f":"D25-D24","v":4.2000000015832484E-2},{"$f":"E25-E24","v":-3.0999999999949068E-2},5.2201532809490194,0,1,1,126.43085848487644,null,null,2.4809322233676983,null,{"$f":"AVERAGE(S36:S37)","v":"2013-08-24"},{"$f":"T36","v":4.078789883232198},{"$f":"U44","v":5.9094262634978989}]
[null,null,null,null,null,{"$f":"A30","v":"80-1"},{"$f":"C31-C30","v":-1.0999999940395355E-2},{"$f":"D31-D30","v":7.6999999990221113E-2},{"$f":"E31-E30","v":-6.7000000000007276E-2},7.7781745912410258,0,1,1,98.130102311709848,null,null,3.69665849713929,null,{"$f":"AVERAGE(S38:S39)","v":"2015-03-15T12:00:00"},{"$f":"T38","v":3.8252925665247908},5.9094262634978989]
[null,null,null,null,null,{"$f":"A36","v":"BH-14"},{"$f":"C37-C36","v":8.8000000454485416E-2},{"$f":"D37-D36","v":0.18600000004516914},{"$f":"E37-E36","v":-1.7000000000052751E-2},20.576685859679237,2,1,3,64.680312980674927,null,null,9.7792842952902639]
[null,null,null,null,null,{"$f":"A42","v":1495},{"$f":"C43-C42","v":7.0999999530613422E-2},{"$f":"D43-D42","v":2.7000000001862645E-2},{"$f":"E43-E42","v":0},7.5960515621260019,2,1,3,20.820892980470568,null,null,3.6101026304374884]
[null,null,null,null,null,null,{"$f":"SUM(G43:G49)","v":8.899999875575304E-2},{"$f":"SUM(H43:H49)","v":0.51600000006146729},{"$f":"AVERAGE(I42:I49)","v":-4.0142857142833624E-2},{"$f":"AVERAGE(J43:J49)","v":8.5822209049926794},null,null,null,null,"avg bearing",{"$f":"ATAN(H50/G50)*180/PI()","v":80.213874771396874}]
[null,null,null,null,null,null,null,null,{"$f":"I50/H41","v":-1.9078311011893587E-2},{"$f":"J50/H41","v":4.078789883232198},"cm/yr",null,null,null,null,null,null,null,null,{"$f":"_xlfn.STDEV.S(Q3:Q10,Q30:Q37,Q43:Q49,Q55:Q61)","v":2.2053123642246693}]
[]
[null,null,null,null,null,"2014 to 2015",null,{"$f":"(B44-B43)/365","v":1.010958904109589},null,"North Upper"]
[null,null,null,null,null,"Point","dN","dE","dz","Movement","N/S","E/W","Quadrant","Azimuth","Max"]
[null,null,null,null,null,{"$f":"A8","v":1483},{"$f":"C8-C7","v":2.4000000208616257E-2},{"$f":"D8-D7","v":7.999999972525984E-3},{"$f":"E8-E7","v":-2.4000000000000909E-2},{"$f":"(G55^2+H55^2)^0.5*100","v":2.5298221470569744},{"$f":"IF(G55>0,2,0)","v":2},{"$f":"IF(H55>0,1,0)","v":1},{"$f":"SUM(K55:L55)","v":3},{"$f":"IF(M55=3,(ATAN(H55/G55)*180/PI()),IF(M55=1,(90+ATAN(ABS(G55)/ABS(H55))*180/PI()),IF(M55=0,(180+ATAN(ABS(H55)/ABS(G55))*180/PI()),IF(M55=2,(270+ATAN(ABS(G55)/ABS(H55))*180/PI()),\"ERROR\"))))","v":18.434948614481179},{"$f":"MAX(J55:J61)","v":7.2401658042937385},{"$f":"O55/H53","v":7.161681622133373},{"$f":"J55/$H$53","v":2.5023986007474139}]
[null,null,null,null,null,{"$f":"A14","v":26},{"$f":"C14-C13","v":4.3000000528991222E-2},{"$f":"D14-D13","v":6.9999999832361937E-3},{"$f":"E14-E13","v":-7.3000000000092768E-2},4.3566042341008577,2,1,3,9.2461126120205499,null,null,{"$f":"J56/$H$53","v":4.3093781719425834}]
[null,null,null,null,null,{"$f":"A20","v":"80-2"},{"$f":"C20-C19","v":3.5000000149011612E-2},{"$f":"D20-D19","v":-2.7999999991152436E-2},{"$f":"E20-E19","v":-6.500000000005457E-2},4.4821869772861431,2,0,2,321.34019187373423,null,null,4.4335995845784346]
[null,null,null,null,null,{"$f":"A26","v":"26-A"},{"$f":"C26-C25","v":6.1000000685453415E-2},{"$f":"D26-D25","v":-3.9000000047963113E-2},{"$f":"E26-E25","v":-2.2000000000048203E-2},7.2401658042937385,2,0,2,327.40741878761378,null,null,7.161681622133373]
[null,null,null,null,null,{"$f":"A32","v":"80-1"},{"$f":"C32-C31","v":4.0000000037252903E-2},{"$f":"D32-D31","v":-2.2999999986495823E-2},{"$f":"E32-E31","v":-1.4000000000010004E-2},4.6141088005800643,2,0,2,330.10109819898116,null,null,4.5640913610073808]
[null,null,null,null,null,{"$f":"A38","v":"BH-14"},{"$f":"C38-C37","v":3.0000000260770321E-2},{"$f":"D38-D37","v":-5.0000000046566129E-3},{"$f":"E38-E37","v":2.0000000000663931E-3},3.0413812909478901,2,0,2,350.53767786408366,null,null,3.0084123880649862]
[null,null,null,null,null,{"$f":"A44","v":1495},{"$f":"C44-C43","v":-8.0000003799796104E-3},{"$f":"D44-D43","v":-9.9999998928979039E-4},{"$f":"E44-E43","v":-2.4000000000000909E-2},0.80622581240154723,0,0,0,187.12501593843371,null,null,0.79748623719936251]
[null,null,null,null,null,null,{"$f":"SUM(G55:G61)","v":0.22500000149011612},{"$f":"SUM(H55:H61)","v":-8.1000000063795596E-2},{"$f":"AVERAGE(I54:I61)","v":-3.1428571428591567E-2},{"$f":"AVERAGE(J55:J61)","v":3.8672135809524595},null,null,null,null,"avg bearing",{"$f":"270+ATAN(G62/ABS(H62))*180/PI()","v":340.20112375202461}]
[null,null,null,null,null,null,null,null,{"$f":"I62/H53","v":-3.1087882307414424E-2},{"$f":"J62/H53","v":3.8252925665247908},"cm/yr"]
[]
[]
[]
[]
[]
[]
[]
[]
[]
[]
[]
[]
[]
[]
[]
[]
[]
[]
[]
[]
[]
[]
[]
[]
[]
[]
[]
[]
[]
[]
[]
[]
[]
[]
[]
[]
[]
[]
[]
[]
[]
[]
[]
[]
[]
[]
[]
[]
[]
[]
[]
[]
[]
[]
[]
[]
[]
[]
[]
[]
[]
[]
[]
[]
[]
[]
[]
[]
[]
[]
[]
[]
[]
[]
[]
[]
[]
[]
[]
[]
[]
[]
[]
[]
[]
[]
[]
[]
[]
[]
[]
[]
[]
[]
[]
[]
[]
[]
[]
[]
[]
[]
[]
[]
[]
[]
[]
[null,null,null,null,null,null,null,null,null,null,null,null,null,null,null,null,null,null,"South"]
[null,null,null,null,null,null,null,null,null,null,null,null,null,null,null,null,null,null,null,"Upper",null,"Mid",null,"Lower",null,"U-M RPC","U-M Angle","U-L RPC","U-L Angle","M-L RPC","M-L Angle",null,null,"TF3","TF5","TF6","TF8"]
[null,null,null,null,null,null,null,null,null,null,null,null,null,null,null,null,null,null,null,"Avg","Azimuth","Avg","Azimuth","Avg","Azimuth",null,null,null,null,null,null,null,"Upper",{"$f":"T174","v":0},{"$f":"T175","v":0},{"$f":"T176","v":0},{"$f":"T177","v":0}]
[null,null,null,null,null,null,null,null,null,null,null,null,null,null,null,null,null,null,"TF3",{"$f":"J176","v":0},{"$f":"P175","v":0},{"$f":"J214","v":0},{"$f":"P213","v":0},{"$f":"J282","v":0},{"$f":"P281","v":0},{"$f":"(V174-T174)/T174","v":{"$error":"#DIV/0!"}},{"$f":"W174-U174","v":0},{"$f":"(X174-T174)/T174","v":{"$error":"#DIV/0!"}},{"$f":"Y174-U174","v":0},{"$f":"(X174-V174)/V174","v":{"$error":"#DIV/0!"}},{"$f":"Y174-W174","v":0},null,"Mid",{"$f":"V174","v":0},{"$f":"V175","v":0},{"$f":"V176","v":0},{"$f":"V177","v":0}]
[null,null,null,null,null,null,null,null,null,null,null,null,null,null,null,null,null,null,"TF5",{"$f":"J183","v":0},{"$f":"P182","v":0},{"$f":"J231","v":0},{"$f":"P230","v":0},{"$f":"J301","v":0},{"$f":"P300","v":0},{"$f":"(V175-T175)/T175","v":{"$error":"#DIV/0!"}},{"$f":"W175-U175","v":0},{"$f":"(X175-T175)/T175","v":{"$error":"#DIV/0!"}},{"$f":"Y175-U175","v":0},{"$f":"(X175-V175)/V175","v":{"$error":"#DIV/0!"}},{"$f":"Y175-W175","v":0},null,"Lower",{"$f":"X174","v":0},{"$f":"X175","v":0},{"$f":"X176","v":0},{"$f":"X177","v":0}]
[null,null,null,null,null,null,null,null,null,null,null,null,null,null,null,null,null,null,"TF6",{"$f":"J190","v":0},{"$f":"P189","v":0},{"$f":"J248","v":0},{"$f":"P247","v":0},{"$f":"J320","v":0},{"$f":"P319","v":0},{"$f":"(V176-T176)/T176","v":{"$error":"#DIV/0!"}},{"$f":"W176-U176","v":0},{"$error":"#DIV/0!"},{"$f":"Y176-U176","v":0},{"$f":"(X176-V176)/V176","v":{"$error":"#DIV/0!"}},{"$f":"Y176-W176","v":0},null,"Upper",{"$f":"U174","v":0},{"$f":"U175","v":0},{"$f":"U176","v":0},{"$f":"U177","v":0}]
[null,null,null,null,null,null,null,null,null,null,null,null,null,null,null,null,null,null,"TF8",{"$f":"J197","v":0},{"$f":"P196","v":0},{"$f":"J265","v":0},{"$f":"P264","v":0},{"$f":"J339","v":0},{"$f":"P338","v":0},{"$f":"(V177-T177)/T177","v":{"$error":"#DIV/0!"}},{"$f":"W177-U177","v":0},{"$error":"#DIV/0!"},{"$f":"Y177-U177","v":0},{"$f":"(X177-V177)/V177","v":{"$error":"#DIV/0!"}},{"$f":"Y177-W177","v":0},null,"Mid",{"$f":"W174","v":0},{"$f":"W175","v":0},{"$f":"W176","v":0},{"$f":"W177","v":0}]
[null,null,null,null,null,null,null,null,null,null,null,null,null,null,null,null,null,null,null,null,null,null,null,null,null,null,null,null,null,null,null,null,"Lower",{"$f":"Y174","v":0},{"$f":"Y175","v":0},{"$f":"Y176","v":0},{"$f":"Y177","v":0}]
[null,null,null,null,null,null,null,null,null,null,null,null,null,null,null,null,null,null,null,null,null,null,null,null,null,null,null,null,null,null,null,null,"RPC Upper",null,{"$f":"(AI173-AH173)/AH173","v":{"$error":"#DIV/0!"}},{"$f":"(AJ173-AI173)/AI173","v":{"$error":"#DIV/0!"}},{"$f":"(AK173-AJ173)/AJ173","v":{"$error":"#DIV/0!"}}]
[null,null,null,null,null,null,null,null,null,null,null,null,null,null,null,null,null,null,null,null,null,null,null,null,null,null,null,null,null,null,null,null,"RPC Mid",null,{"$f":"(AI174-AH174)/AH174","v":{"$error":"#DIV/0!"}},{"$error":"#DIV/0!"},{"$error":"#DIV/0!"}]
[null,null,null,null,null,null,null,null,null,null,null,null,null,null,null,null,null,null,null,null,null,null,null,null,null,null,null,null,null,null,null,null,"RPC Lower",null,{"$f":"(AI175-AH175)/AH175","v":{"$error":"#DIV/0!"}},{"$error":"#DIV/0!"},{"$error":"#DIV/0!"}]
[null,null,null,null,null,null,null,null,null,null,null,null,null,null,null,null,null,null,null,null,null,null,null,null,null,null,null,null,null,null,null,null,"Upper",null,{"$f":"AI176-AH176","v":0},{"$f":"AJ176-AI176","v":0},0]
[null,null,null,null,null,null,null,null,null,null,null,null,null,null,null,null,null,null,null,null,null,null,null,null,null,null,null,null,null,null,null,null,"Mid",null,{"$f":"AI177-AH177","v":0},0,0]
[null,null,null,null,null,null,null,null,null,null,null,null,null,null,null,null,null,null,null,null,null,null,null,null,null,null,null,null,null,null,null,null,"Lower",null,{"$f":"AI178-AH178","v":0},0,0]
[]
[]
[]
[null,null,null,null,null,null,null,null,null,null,null,null,null,null,null,null,null,null,null,"Upper Slope","Mid Slope","Lower Slope"]
[null,null,null,null,null,null,null,null,null,null,null,null,null,null,null,null,null,null,"2006-07-28",{"$f":"T174","v":0},{"$f":"V174","v":0},{"$f":"X174","v":0}]
[null,null,null,null,null,null,null,null,null,null,null,null,null,null,null,null,null,null,"2010-07-20",{"$f":"T174","v":0},{"$f":"V174","v":0},{"$f":"X174","v":0}]
[null,null,null,null,null,null,null,null,null,null,null,null,null,null,null,null,null,null,"2010-07-20",{"$f":"T175","v":0},{"$f":"V175","v":0},{"$f":"X175","v":0}]
[null,null,null,null,null,null,null,null,null,null,null,null,null,null,null,null,null,null,"2010-09-25",{"$f":"T175","v":0},{"$f":"V175","v":0},{"$f":"X175","v":0}]
[null,null,null,null,null,null,null,null,null,null,null,null,null,null,null,null,null,null,"2010-09-25",{"$f":"T176","v":0},{"$f":"V176","v":0},{"$f":"X176","v":0}]
[null,null,null,null,null,null,null,null,null,null,null,null,null,null,null,null,null,null,"2012-08-06",{"$f":"T176","v":0},{"$f":"V176","v":0},{"$f":"X176","v":0}]
[null,null,null,null,null,null,null,null,null,null,null,null,null,null,null,null,null,null,"2012-08-06",{"$f":"T177","v":0},{"$f":"V177","v":0},{"$f":"X177","v":0}]
[null,null,null,null,null,null,null,null,null,null,null,null,null,null,null,null,null,null,"2014-09-11",{"$f":"T177","v":0},{"$f":"V177","v":0},{"$f":"X177","v":0}]

{"sheet":"Access Road Cracks","index":3,"n_rows":94,"n_cols":30,"rows_kept":94,"cut":false,"hidden":false,"merged":[[0,5,0,7],[0,11,0,13],[0,1,0,4],[10,22,10,24],[11,22,11,24],[15,22,15,24],[16,22,16,24],[12,22,12,24],[13,22,13,24],[14,22,14,24],[17,22,17,24],[18,22,18,24],[20,22,20,24],[21,22,21,24],[22,22,22,24],[19,22,19,24]]}
[null,2015,null,null,null,2014,null,null,2013,null,null,2012,null,null,"Movement from 2012 to 2013"]
["Point ID","Northing","Easting","Elevation","Distance to adjacent Baseline Point (2012)","Northing","Easting","Elevation",null,null,null,"Northing","Easting","Elevation","dN","dE","dZ","Movement (mm)",null,null,null,null,null,null,"year","2D Surface area between baseline and embankment (m2)","Length of Baseline","Average Offset"]
[5001,7147308.6890000002,513168.75599999999,415.43900000000002,null,7147308.6789999995,513168.76199999999,415.41,7147308.6730000004,513168.75699999998,415.43599999999998,7147308.6660000002,513168.76500000001,415.42500000000001,{"$f":"I3-L3","v":7.0000002160668373E-3},{"$f":"J3-M3","v":-8.000000030733645E-3},{"$f":"K3-N3","v":1.0999999999967258E-2},{"$f":"(O3^2+P3^2)^0.5","v":1.0630145978145083E-2},{"$f":"IF(O3>0,2,0)","v":2},{"$f":"IF(P3>0,1,0)","v":0},{"$f":"SUM(S3:T3)","v":2},{"$f":"IF(U3=3,(ATAN(P3/O3)*180/PI()),IF(U3=1,(90+ATAN(ABS(O3)/ABS(P3))*180/PI()),IF(U3=0,(180+ATAN(ABS(P3)/ABS(O3))*180/PI()),IF(U3=2,(270+ATAN(ABS(O3)/ABS(P3))*180/PI()),\"ERROR\"))))","v":311.18592593306704},null,null,2012,387.68900000000002,65.978999999999999,{"$f":"Z3/AA3","v":5.8759453765592085}]
[5002,7147307.8459999999,513171.701,415.28899999999999,null,7147307.8289999999,513171.7,415.255,7147307.8329999996,513171.70199999999,415.26600000000002,7147307.824,513171.71299999999,415.274,8.999999612569809E-3,-1.0999999998603016E-2,-7.9999999999813554E-3,{"$f":"(O4^2+P4^2)^0.5","v":1.4212670157135255E-2},2,0,2,309.28940565725827,null,null,2014,366.66,65.971000000000004,{"$f":"Z4/AA4","v":5.5578966515590187}]
[5003,7147307.0199999996,513174.51799999998,415.09699999999998,null,7147307.0010000002,513174.5,415.06200000000001,7147306.9979999997,513174.51799999998,415.084,7147307,513174.52299999999,415.09,-2.0000003278255463E-3,-5.0000000046566129E-3,-5.9999999999718057E-3,5.3851649332094208E-3,0,0,0,248.1985872935968,null,null,2015,626.53700000000003,95.978999999999999,{"$f":"Z5/AA5","v":6.5278550516258766}]
[5004,7147306.1409999998,513177.38799999998,414.839,null,7147306.1229999997,513177.38500000001,414.81400000000002,7147306.1299999999,513177.38799999998,414.83100000000002,7147306.1189999999,513177.39500000002,414.82900000000001,1.0999999940395355E-2,-7.0000000414438546E-3,2.0000000000095497E-3,1.3038404782369345E-2,2,0,2,327.52880741488212,null,null,null,{"$f":"(Z3-Z4)/66","v":0.31862121212121208}]
[5005,7147305.335,513180.255,414.55500000000001,null,7147305.3260000004,513180.24800000002,414.54199999999997,7147305.3190000001,513180.26,414.55799999999999,7147305.3090000004,513180.266,414.54,9.9999997764825821E-3,-5.9999999939464033E-3,1.799999999997226E-2,1.1661903594911446E-2,2,0,2,329.03624292843256,null,null,null,{"$f":"Z6/2.1","v":0.15172438672438671}]
[5006,7147304.4749999996,513183.16399999999,414.22199999999998,null,7147304.4639999997,513183.15399999998,414.21600000000001,7147304.4749999996,513183.16,414.22199999999998,7147304.4579999996,513183.16899999999,414.23700000000002,1.6999999992549419E-2,-9.0000000200234354E-3,-1.5000000000043201E-2,1.9235384064455331E-2,2,0,2,332.10272890595678]
[5007,7147303.6299999999,513186.03399999999,413.89299999999997,null,7147303.6169999996,513186.03600000002,413.88,7147303.6229999997,513186.03700000001,413.89,7147303.6040000003,513186.03899999999,413.90300000000002,1.8999999389052391E-2,-1.9999999785795808E-3,-1.3000000000033651E-2,1.910497256470968E-2,2,0,2,353.9909939145856,null,null,"2015 Stats"]
[5008,7147302.7750000004,513188.91700000002,413.57299999999998,null,7147302.7790000001,513188.91499999998,413.56700000000001,7147302.7599999998,513188.91700000002,413.58100000000002,7147302.7439999999,513188.92,413.577,1.5999999828636646E-2,-2.9999999678693712E-3,4.0000000000190994E-3,1.6278820421750124E-2,2,0,2,349.38034472384487]
[5009,7147301.9199999999,513191.79100000003,413.26100000000002,null,7147301.9060000004,513191.78700000001,413.24700000000001,7147301.9050000003,513191.78899999999,413.26600000000002,7147301.8799999999,513191.78700000001,413.26900000000001,2.500000037252903E-2,1.9999999785795808E-3,-2.9999999999859028E-3,2.5079872777603356E-2,2,1,3,4.5739211432535294,"Edge lost 96m baseline",null,null,33.216000000000001,"sq.m",{"$f":"Z11/96","v":0.34600000000000003}]
[5010,7147301.0779999997,513194.66399999999,412.91,null,7147301.0769999996,513194.64799999999,412.90199999999999,7147301.0659999996,513194.66100000002,412.93,7147301.0489999996,513194.65899999999,412.93799999999999,1.6999999992549419E-2,2.0000000367872417E-3,-7.9999999999813554E-3,1.7117242765522411E-2,2,1,3,6.7098369329637126,"Edge lost 66m baseline",null,null,23.65,"sq.m",{"$f":"Z12/66","v":0.35833333333333334}]
[5011,7147300.2589999996,513197.554,412.59500000000003,null,7147300.2520000003,513197.52799999999,412.57900000000001,7147300.2419999996,513197.538,412.60199999999998,7147300.2180000003,513197.54,412.60599999999999,2.3999999277293682E-2,-1.9999999785795808E-3,-4.0000000000190994E-3,2.4083188435595808E-2,2,0,2,355.23635821727237]
[5012,7147299.4129999997,513200.43199999997,412.233,null,7147299.4009999996,513200.41,412.22199999999998,7147299.3859999999,513200.41800000001,412.25099999999998,7147299.3710000003,513200.41399999999,412.26400000000001,1.4999999664723873E-2,4.0000000153668225E-3,-1.3000000000033651E-2,1.5524174376263971E-2,2,1,3,14.93141755177424]
[5013,7147298.5760000004,513203.31900000002,411.86399999999998,null,7147298.5599999996,513203.32,411.85500000000002,7147298.5439999998,513203.3,411.88400000000001,7147298.5209999997,513203.29700000002,411.89400000000001,2.3000000044703484E-2,2.9999999678693712E-3,-9.9999999999909051E-3,2.319482704965865E-2,2,1,3,7.4314078781877511,"Max edge lost",null,null,2.0539999999999998,"m"]
[5014,7147297.7520000003,513206.179,411.49299999999999,null,7147297.733,513206.18199999997,411.48599999999999,7147297.7220000001,513206.16200000001,411.524,7147297.6859999998,513206.15600000002,411.55,3.6000000312924385E-2,5.9999999939464033E-3,-2.6000000000010459E-2,3.6496575489460822E-2,2,1,3,9.4623221178890429,"Surface area baseline to edge (96m base)",null,null,{"$f":"Z5","v":626.53700000000003},"sq.m"]
[5015,7147296.8959999997,513209.065,411.12200000000001,null,7147296.8820000002,513209.08500000002,411.125,7147296.8550000004,513209.06,411.149,7147296.824,513209.054,411.16800000000001,3.1000000424683094E-2,5.9999999939464033E-3,-1.9000000000005457E-2,3.1575307223488877E-2,2,1,3,10.954062486179176,"Average offset (96m base)",null,null,{"$f":"AB5","v":6.5278550516258766},"m"]
[5016,7147296.0420000004,513211.94799999997,410.76499999999999,null,7147296.0379999997,513211.935,410.76900000000001,7147296.0130000003,513211.93099999998,410.78800000000001,7147295.9929999998,513211.935,410.81099999999998,2.0000000484287739E-2,-4.0000000153668225E-3,-2.2999999999967713E-2,2.0396078532268019E-2,2,0,2,348.69006775045455,"Surface area baseline to edge (66m base)",null,null,339.56200000000001,"sq.m"]
[5017,7147295.1969999997,513214.799,410.41699999999997,null,7147295.1919999998,513214.80200000003,410.42700000000002,7147295.1540000001,513214.79700000002,410.45100000000002,7147295.1289999997,513214.79499999998,410.45299999999997,2.500000037252903E-2,2.0000000367872417E-3,-1.9999999999527063E-3,2.507987278224514E-2,2,1,3,4.573921275807316,"Average offset (66m base)",null,null,{"$f":"Z18/65.989","v":5.1457364106138899},"m"]
[5018,7147294.3490000004,513217.67099999997,410.08199999999999,null,7147294.3389999997,513217.66800000001,410.07900000000001,7147294.3039999995,513217.67700000003,410.113,7147294.2960000001,513217.66899999999,410.11,7.9999994486570358E-3,8.000000030733645E-3,2.9999999999859028E-3,1.1313708130858387E-2,2,1,3,45.000002084408386,"Total crack length",null,null,{"$f":"B78","v":123.99750000000002}]
[5019,7147293.5010000002,513220.53700000001,409.75299999999999,null,7147293.4790000003,513220.56099999999,409.755,7147293.4680000003,513220.54399999999,409.77100000000002,7147293.4440000001,513220.549,409.774,2.4000000208616257E-2,-5.0000000046566129E-3,-2.9999999999859028E-3,2.451530154944349E-2,2,0,2,348.23171115676615,"Weighted average crack length",null,null,{"$f":"D79","v":0.15765152523236356}]
[5020,7147292.6500000004,513223.42099999997,409.41199999999998,null,7147292.6370000001,513223.41800000001,409.40499999999997,7147292.6210000003,513223.42,409.41699999999997,7147292.591,513223.43099999998,409.42200000000003,3.0000000260770321E-2,-1.0999999998603016E-2,-5.0000000000522959E-3,3.1953090861691076E-2,2,0,2,339.86369673507477]
[5021,7147291.7989999996,513226.30900000001,409.04700000000003,null,7147291.7920000004,513226.30599999998,409.041,7147291.767,513226.31400000001,409.05099999999999,7147291.7549999999,513226.32400000002,409.05599999999998,1.2000000104308128E-2,-1.0000000009313226E-2,-4.9999999999954525E-3,1.5620499437907215E-2,2,0,2,320.19442912642683,"Number of cracks",null,null,30]
[5022,7147290.9510000004,513229.17700000003,408.73399999999998,null,7147290.9299999997,513229.19300000003,408.72199999999998,7147290.9199999999,513229.19099999999,408.74799999999999,7147290.9129999997,513229.19500000001,408.74400000000003,7.0000002160668373E-3,-4.0000000153668225E-3,3.999999999962256E-3,8.0622579435211793E-3,2,0,2,330.25511937006843]
[5000,7147290.0880000005,513232.06800000003,408.452,null,7147290.0779999997,513232.05499999999,408.46300000000002,7147290.0760000004,513232.06099999999,408.45800000000003,7147290.0650000004,513232.06699999998,408.45400000000001,1.0999999940395355E-2,-5.9999999939464033E-3,4.0000000000190994E-3,1.2529964030916236E-2,2,0,2,331.38954022782286,null,null,"Control point",3819]
[6027,7147289.2379999999,513234.93400000001,408.12799999999999,null,null,null,null,null,null,null,null,null,null,null,null,null,null,null,null,null,null,null,null,"Std dev N",5.5999999999999999E-3]
[6026,7147288.4110000003,513237.815,407.86099999999999,null,null,null,null,null,null,null,null,null,null,null,null,null,null,null,null,null,null,null,null,"Std dev E",3.5999999999999999E-3]
[6025,7147287.5530000003,513240.696,407.58199999999999,null,null,null,null,null,null,null,null,null,null,null,null,null,null,null,null,null,null,null,null,"Avg accuracy",{"$f":"(Z26^2+Z27^2)^0.5*100","v":0.66573267908372946}]
[6024,7147286.7180000003,513243.57299999997,407.36399999999998,null,null,null,null,null,null,null,null,null,null,null,null,null,null,null,null,null,null,null,null,null,null,"2.1 yrs","1 yr",null,"RPC"]
[6023,7147285.8729999997,513246.46500000003,407.113,null,null,null,null,null,null,null,null,null,null,null,null,null,null,null,null,null,null,null,null,null,null,"2012-2014","2014-2015"]
[6032,7147312.909,513154.37400000001,415.33100000000002,null,null,null,null,null,null,null,null,null,null,null,null,null,null,null,null,null,null,null,null,"baseline","Horizontal avg",{"$f":"S64","v":1.5527694535754357},{"$f":"S92/1.02","v":1.6430165383307285},"cm/y",{"$f":"(AB31-AA31)/AA31","v":5.8120079930403148E-2}]
[6031,7147312.0820000004,513157.25199999998,415.36500000000001,null,null,null,null,null,null,null,null,null,null,null,null,null,null,null,null,null,null,null,null,null,"horizontal azimuth",{"$f":"X64","v":354.41934867613799},{"$f":"X92","v":14.437960029796415},null,{"$f":"360-AA32+AB32","v":20.018611353658429}]
[6030,7147311.2170000002,513160.12400000001,415.42200000000003,null,null,null,null,null,null,null,null,null,null,null,null,null,null,null,null,null,null,null,null,null,"horizontal max",{"$f":"S65","v":3.1316539223235513},{"$f":"S93/1.02","v":3.1919255974310805},"cm/y",{"$f":"(AB33-AA33)/AA33","v":1.9245956482576532E-2}]
[6029,7147310.3799999999,513163.00699999998,415.50599999999997,null,null,null,null,null,null,null,null,null,null,null,null,null,null,null,null,null,null,null,null,null,"Vertical avg",{"$f":"Q64*100/2.1","v":-1.1697722567288915},{"$f":"Q92*100/1.02","v":0.95481670929188345},"cm/y",{"$f":"(AB34-AA34)/AA34","v":-1.8162415408636021}]
[6028,7147309.5360000003,513165.88799999998,415.48899999999998,null,null,null,null,null,null,null,null,null,null,null,null,null,null,null,null,null,null,null,null,null,"vertical max",{"$f":"Q65*100/2.1","v":-3.0476190476200653},{"$f":"Q93*100/1.02","v":3.431372549016487},null,{"$f":"(AB35-AA35)/AA35","v":-2.1259191176456587}]
[null,null,null,null,null,null,null,null,null,null,null,null,null,null,{"$f":"SUM(O3:O25)","v":0.39499999955296516},{"$f":"SUM(P3:P25)","v":-5.9999999997671694E-2},{"$f":"AVERAGE(Q3:Q25)/'[1]Gabion Structures movement'!$AJ$30*100","v":-0.24239414235456666},{"$f":"AVERAGE(R3:R25)","v":1.8786496864483925E-2},{"$f":"R36*100","v":1.8786496864483926},null,null,null,"Avg Bearing",{"$f":"270+ATAN(O36/ABS(P36))*180/PI()","v":351.36286857563186},"Edge","Edge lost avg",{"$f":"(Z3-Z4)/66/2.1*100","v":15.17243867243867},{"$f":"23.65/66/1.02*100","v":35.130718954248366},"m/y",{"$f":"(AB36-AA36)/AA36","v":1.3154299524745943}]
[null,null,null,null,null,null,null,null,null,null,null,null,null,null,null,null,{"$f":"MIN((Q3:Q25))*100","v":-2.6000000000010459},{"$f":"MAX(R3:R25)","v":3.6496575489460822E-2},{"$f":"R37*100","v":3.6496575489460823},null,null,null,null,null,null,"Edge lost max",{"$f":"2.14/2.1*100","v":101.9047619047619},{"$f":"2.06/1.02*100","v":201.96078431372547},"m/y",{"$f":"(AB37-AA37)/AA37","v":0.98185816382627811}]
[]
[null,null,null,null,null,null,null,null,null,null,null,null,null,null,"Movement from 2012 to 2014"]
[null,null,null,null,null,null,null,null,null,null,null,null,null,null,"dN","dE","dZ","Movement'"]
[null,null,null,null,null,"NOTES:",null,null,null,null,null,null,null,null,{"$f":"F3-L3","v":1.2999999336898327E-2},{"$f":"G3-M3","v":-3.0000000260770321E-3},{"$f":"H3-N3","v":-1.4999999999986358E-2},{"$f":"(O41^2+P41^2)^0.5","v":1.3341663423869572E-2},{"$f":"IF(O41>0,2,0)","v":2},{"$f":"IF(P41>0,1,0)","v":0},{"$f":"SUM(S41:T41)","v":2},{"$f":"IF(U41=3,(ATAN(P41/O41)*180/PI()),IF(U41=1,(90+ATAN(ABS(O41)/ABS(P41))*180/PI()),IF(U41=0,(180+ATAN(ABS(P41)/ABS(O41))*180/PI()),IF(U41=2,(270+ATAN(ABS(O41)/ABS(P41))*180/PI()),\"ERROR\"))))","v":347.00538245863328},null,null,null,{"$f":"(42-112)/112","v":-0.625}]
[null,null,null,null,null,1,"General movement trend from 2012 - 2014 is towards the NE",null,null,null,null,null,null,null,{"$f":"F4-L4","v":4.999999888241291E-3},-1.2999999977182597E-2,-1.9000000000005457E-2,{"$f":"(O42^2+P42^2)^0.5","v":1.3928388215768557E-2},2,0,2,291.03751063002892]
[null,null,null,null,null,2," Surface area is considered 2D",null,null,null,null,null,null,null,{"$f":"F5-L5","v":1.0000001639127731E-3},-2.2999999986495823E-2,-2.7999999999963165E-2,2.3021728860071162E-2,2,0,2,272.48955333101514]
[null,null,null,null,null,3,"Exact crack location is not provided in the 2014 survey",null,null,null,null,null,null,null,{"$f":"F6-L6","v":3.9999997243285179E-3},-1.0000000009313226E-2,-1.4999999999986358E-2,1.0770329520534305E-2,2,0,2,291.80140810632975]
[null,null,null,null,null,null,null,null,null,null,null,null,null,null,{"$f":"F7-L7","v":1.6999999992549419E-2},-1.799999998183921E-2,1.9999999999527063E-3,2.4758836787961019E-2,2,0,2,313.36342297470492]
[null,null,null,null,null,null,null,null,null,null,null,null,null,null,{"$f":"F8-L8","v":6.0000000521540642E-3},-1.5000000013969839E-2,-2.1000000000015007E-2,1.6155494453743716E-2,2,0,2,291.80140963968762]
["Crack","Length","Width","Product",null,null,null,null,null,null,null,null,null,null,{"$f":"F9-L9","v":1.2999999336898327E-2},-2.9999999678693712E-3,-2.3000000000024556E-2,1.3341663410781024E-2,2,0,2,347.0053827022046]
["6386-6388",0.83399999999999996,0.1,{"$f":"B48*C48","v":8.3400000000000002E-2},null,null,null,null,null,null,null,null,null,null,{"$f":"F10-L10","v":3.5000000149011612E-2},-5.0000000046566129E-3,-9.9999999999909051E-3,3.5355339207499892E-2,2,0,2,351.86989767252447]
[6389,0.2,7.0000000000000007E-2,{"$f":"B49*C49","v":1.4000000000000002E-2},null,null,null,null,null,null,null,null,null,null,{"$f":"F11-L11","v":2.6000000536441803E-2},0,-2.199999999999136E-2,2.6000000536441803E-2,2,0,2,{"$error":"#DIV/0!"}]
[6390,0.15,0.04,6.0000000000000001E-3,null,null,null,null,null,null,null,null,null,null,{"$f":"F12-L12","v":2.7999999932944775E-2},-1.0999999998603016E-2,-3.6000000000001364E-2,3.0083217850060084E-2,2,0,2,338.55226362867296]
["6392-6393",0.33,0.2,6.6000000000000003E-2,null,null,null,null,null,null,null,null,null,null,{"$f":"F13-L13","v":3.3999999985098839E-2},-1.1999999987892807E-2,-2.6999999999986812E-2,3.6055512736558722E-2,2,0,2,340.55996518208553]
["6394-6409",6.1070000000000002,0.1,0.61070000000000002,null,null,null,null,null,null,null,null,null,null,{"$f":"F14-L14","v":2.9999999329447746E-2},-4.0000000153668225E-3,-4.2000000000030013E-2,3.0265491238203945E-2,2,0,2,352.40535643480064]
["6410-6412",0.57899999999999996,0.28000000000000003,0.16212000000000001,null,null,null,null,null,null,null,null,null,null,{"$f":"F15-L15","v":3.899999987334013E-2},2.2999999986495823E-2,-3.8999999999987267E-2,4.5276925574726665E-2,2,1,3,30.529705966635177]
["6413-6415",1.7529999999999999,0.15,0.26294999999999996,null,null,null,null,null,null,null,null,null,null,{"$f":"F16-L16","v":4.700000025331974E-2},2.5999999954365194E-2,-6.4000000000021373E-2,5.371219620755649E-2,2,1,3,28.950995034067144]
["6427-6446",1.0615000000000001,{"$f":"(0.12+0.34)/2","v":0.23},0.24414500000000003,null,null,null,null,null,null,null,null,null,null,{"$f":"F17-L17","v":5.8000000193715096E-2},3.1000000017229468E-2,-4.3000000000006366E-2,6.5764732368794585E-2,2,1,3,28.123735316973303]
["6416-6426",4.08,0.12,0.48959999999999998,null,null,null,null,null,null,null,null,null,null,{"$f":"F18-L18","v":4.4999999925494194E-2},0,-4.199999999997317E-2,4.4999999925494194E-2,2,0,2,{"$error":"#DIV/0!"}]
["6455-6458",1.1870000000000001,0.09,0.10682999999999999,null,null,null,null,null,null,null,null,null,null,{"$f":"F19-L19","v":6.3000000081956387E-2},7.0000000414438546E-3,-2.5999999999953616E-2,6.3387696052993742E-2,2,1,3,6.3401917749608963]
["6459-6471",5.2889999999999997,0.1,0.52890000000000004,null,null,null,null,null,null,null,null,null,null,{"$f":"F20-L20","v":4.2999999597668648E-2},-9.9999998928979039E-4,-3.1000000000005912E-2,4.3011625932741528E-2,2,0,2,358.66778014793312]
["6472-6499",11.759,0.17,1.9990300000000003,null,null,null,null,null,null,null,null,null,null,{"$f":"F21-L21","v":3.5000000149011612E-2},1.1999999987892807E-2,-1.9000000000005457E-2,3.7000000137030274E-2,2,1,3,18.924644323478539]
["6503-6485",3.766,0.12,0.45191999999999999,null,null,null,null,null,null,null,null,null,null,{"$f":"F22-L22","v":4.6000000089406967E-2},-1.2999999977182597E-2,-1.7000000000052751E-2,4.7801673690700291E-2,2,0,2,344.2192467459472]
["6488-6491",0.95899999999999996,0.12,0.11507999999999999,null,null,null,null,null,null,null,null,null,null,{"$f":"F23-L23","v":3.7000000476837158E-2},-1.8000000040046871E-2,-1.4999999999986358E-2,4.1146081669189802E-2,2,0,2,334.05770475045705]
["6500-6502",1.0389999999999999,0.13,0.13507,null,null,null,null,null,null,null,null,null,null,{"$f":"F24-L24","v":1.6999999992549419E-2},-1.9999999785795808E-3,-2.2000000000048203E-2,1.7117242758721351E-2,2,0,2,353.29016326053767]
["6449-6447",1.357,0.13,0.17641000000000001,null,null,null,null,null,null,null,null,null,null,{"$f":"F25-L25","v":1.2999999336898327E-2},-1.1999999987892807E-2,9.0000000000145519E-3,1.7691805517492675E-2,2,0,2,317.29060861485209]
["6450-6454",2.5569999999999999,0.13,0.33240999999999998,null,null,null,null,null,null,null,null,null,null,{"$f":"SUM(O41:O63)","v":0.65499999839812517},{"$f":"SUM(P41:P63)","v":-6.3999999954830855E-2},{"$f":"AVERAGE(Q41:Q63)","v":-2.456521739130672E-2},{"$f":"AVERAGE(R41:R63)","v":3.2608158525084148E-2},{"$f":"R64*100/2.1","v":1.5527694535754357},null,null,null,"average bearting",{"$f":"270+ATAN(O64/ABS(P64))*180/PI()","v":354.41934867613799}]
["6510-6528",30.521000000000001,0.25,7.6302500000000002,null,null,null,null,null,null,null,null,null,null,null,null,{"$f":"MIN(Q41:Q63)","v":-6.4000000000021373E-2},{"$f":"MAX(R41:R63)","v":6.5764732368794585E-2},{"$f":"R65*100/2.1","v":3.1316539223235513}]
["6523-6525",3.2469999999999999,0.25,0.81174999999999997,null,null,null,null,null,null,null,null,null,null,null,null,{"$f":"MIN(Q41:Q63)","v":-6.4000000000021373E-2},{"$f":"Q64*100/2.1","v":-1.1697722567288915}]
["6529-6531",1.177,0.1,0.11770000000000001,null,null,null,null,null,null,null,null,null,null,"Movement from 2014 to 2015"]
["6532-6541",9.56,0.06,0.5736,null,null,null,null,null,null,null,null,null,null,"dN","dE","dZ","Movement'"]
["6542-6546",2.1,7.0000000000000007E-2,0.14700000000000002,null,null,null,null,null,null,null,null,null,null,{"$f":"B3-F3","v":1.0000000707805157E-2},{"$f":"C3-G3","v":-5.9999999939464033E-3},{"$f":"D3-H3","v":2.8999999999996362E-2},{"$f":"(O69^2+P69^2)^0.5","v":1.1661904393513972E-2},{"$f":"IF(O69>0,2,0)","v":2},{"$f":"IF(P69>0,1,0)","v":0},{"$f":"SUM(S69:T69)","v":2},{"$f":"IF(U69=3,(ATAN(P69/O69)*180/PI()),IF(U69=1,(90+ATAN(ABS(O69)/ABS(P69))*180/PI()),IF(U69=0,(180+ATAN(ABS(P69)/ABS(O69))*180/PI()),IF(U69=2,(270+ATAN(ABS(O69)/ABS(P69))*180/PI()),\"ERROR\"))))","v":329.03624528258774}]
["6547-6551",2.6909999999999998,0.15,0.40364999999999995,null,null,null,null,null,null,null,null,null,null,{"$f":"B4-F4","v":1.6999999992549419E-2},9.9999998928979039E-4,3.3999999999991815E-2,{"$f":"(O70^2+P70^2)^0.5","v":1.7029386357859753E-2},2,1,3,3.3664606289292496]
["6552-6556",2.1960000000000002,0.2,0.43920000000000003,null,null,null,null,null,null,null,null,null,null,{"$f":"B5-F5","v":1.8999999389052391E-2},1.799999998183921E-2,3.4999999999968168E-2,2.6172504200595761E-2,2,1,3,43.451843191992495]
["6557-6566",4.7629999999999999,0.2,0.9526,null,null,null,null,null,null,null,null,null,null,{"$f":"B6-F6","v":1.8000000156462193E-2},2.9999999678693712E-3,2.4999999999977263E-2,1.8248287739945773E-2,2,1,3,9.4623220277524673]
["6567-6592",12.118,0.12,1.4541599999999999,null,null,null,null,null,null,null,null,null,null,{"$f":"B7-F7","v":8.999999612569809E-3},6.9999999832361937E-3,1.3000000000033651E-2,1.1401753934880521E-2,2,1,3,37.874984779885509]
["6593-6595",2.077,0.1,0.2077,null,null,null,null,null,null,null,null,null,null,{"$f":"B8-F8","v":1.0999999940395355E-2},1.0000000009313226E-2,5.9999999999718057E-3,1.4866068709479393E-2,2,1,3,42.273689187182605]
["6596-6598",0.92600000000000005,7.0000000000000007E-2,6.4820000000000003E-2,null,null,null,null,null,null,null,null,null,null,{"$f":"B9-F9","v":1.3000000268220901E-2},-2.0000000367872417E-3,1.2999999999976808E-2,1.3152946708661618E-2,2,0,2,351.25383775672253]
["6599-6607",6.0780000000000003,0.1,0.60780000000000012,null,null,null,null,null,null,null,null,null,null,{"$f":"B10-F10","v":-3.9999997243285179E-3},2.0000000367872417E-3,5.9999999999718057E-3,4.4721357248832675E-3,0,1,1,153.43494682188992]
["6608-6613",3.536,0.1,0.35360000000000003,null,null,null,null,null,null,null,null,null,null,{"$f":"B11-F11","v":1.39999995008111E-2},4.0000000153668225E-3,1.4000000000010004E-2,1.4560219302800546E-2,2,1,3,15.945396498715448]
["Total",{"$f":"SUM(B48:B77)","v":123.99750000000002},null,{"$f":"SUM(D48:D77)","v":19.548395000000003},null,null,null,null,null,null,null,null,null,null,{"$f":"B12-F12","v":1.0000001639127731E-3},1.6000000003259629E-2,8.0000000000381988E-3,1.6031219555359279E-2,2,1,3,86.423665041043904]
["Average",{"$f":"AVERAGE(B48:B77)","v":4.1332500000000003},null,{"$f":"D78/B78","v":0.15765152523236356},null,null,null,null,null,null,null,null,null,null,{"$f":"B13-F13","v":6.9999992847442627E-3},2.6000000012572855E-2,1.6000000000019554E-2,2.692582386186556E-2,2,1,3,74.931513317131405]
["Max",{"$f":"MAX(B48:B77)","v":30.521000000000001},null,null,null,null,null,null,null,null,null,null,null,null,{"$f":"B14-F14","v":1.2000000104308128E-2},2.1999999997206032E-2,1.1000000000024102E-2,2.5059928219778694E-2,2,1,3,61.38954012161102]
[null,null,null,null,null,null,null,null,null,null,null,null,null,null,{"$f":"B15-F15","v":1.6000000759959221E-2},-9.9999998928979039E-4,8.9999999999577085E-3,1.6031220299692575E-2,2,0,2,356.42366583263242]
[null,null,null,null,null,null,null,null,null,null,null,null,null,null,{"$f":"B16-F16","v":1.9000000320374966E-2},-2.9999999678693712E-3,7.0000000000050022E-3,1.9235384373114697E-2,2,0,2,351.02737362847233]
[null,"Offset from baseline","Average",null,null,null,null,null,null,null,null,null,null,null,{"$f":"B17-F17","v":1.39999995008111E-2},-2.0000000018626451E-2,-2.9999999999859028E-3,2.4413110960460758E-2,2,0,2,304.99201921371071]
[2012,386.7,{"$f":"B84/66","v":5.8590909090909093},null,null,null,null,null,null,null,null,null,null,null,{"$f":"B18-F18","v":4.0000006556510925E-3},1.2999999977182597E-2,-4.0000000000190994E-3,1.3601470679744772E-2,2,1,3,72.897268362905024]
[2014,363.6,{"$f":"B85/66","v":5.5090909090909097},{"$f":"(C84-C85)/2.1*100","v":16.66666666666665},null,null,null,null,null,null,null,null,null,null,{"$f":"B19-F19","v":4.999999888241291E-3},-3.0000000260770321E-3,-1.0000000000047748E-2,5.8309518124295212E-3,2,0,2,329.03624268320806]
[2015,339.6,{"$f":"B86/66","v":5.1454545454545455},{"$f":"(C85-C86)/1.02*100","v":35.650623885918058},{"$f":"(D86-D85)/D85","v":1.1390374331550857},null,null,null,null,null,null,null,null,null,{"$f":"B20-F20","v":1.0000000707805157E-2},2.9999999678693712E-3,2.9999999999859028E-3,1.0440307177632268E-2,2,1,3,16.699242948927292]
[null,null,null,null,null,null,null,null,null,null,null,null,null,null,{"$f":"B21-F21","v":2.199999988079071E-2},-2.3999999975785613E-2,-2.0000000000095497E-3,3.2557641093797024E-2,2,0,2,312.51044695214978]
[null,null,null,null,null,null,null,null,null,null,null,null,null,null,{"$f":"B22-F22","v":1.3000000268220901E-2},2.9999999678693712E-3,7.0000000000050022E-3,1.3341664318253541E-2,2,1,3,12.994616398455168]
[null,null,null,null,null,null,null,null,null,null,null,null,null,null,{"$f":"B23-F23","v":6.9999992847442627E-3},3.0000000260770321E-3,6.0000000000286491E-3,7.6157724587124047E-3,2,1,3,23.198592813685146]
[null,null,null,null,null,null,null,null,null,null,null,null,null,null,{"$f":"B24-F24","v":2.1000000648200512E-2},-1.6000000003259629E-2,1.2000000000000455E-2,2.6400758082462901E-2,2,0,2,322.69605256893828]
[null,null,null,null,null,null,null,null,null,null,null,null,null,null,{"$f":"B25-F25","v":1.0000000707805157E-2},1.3000000035390258E-2,-1.1000000000024102E-2,1.6401219926464324E-2,2,1,3,52.431406086681484]
[null,null,null,null,null,null,null,null,null,null,null,null,null,null,{"$f":"SUM(O69:O91)","v":0.26800000201910734},{"$f":"SUM(P69:P91)","v":6.8999999959487468E-2},{"$f":"AVERAGE(Q69:Q91)","v":9.7391304347772111E-3},{"$f":"AVERAGE(R69:R91)","v":1.6758768690973432E-2},{"$f":"R92*100","v":1.6758768690973431},null,null,null,"average bearting",{"$f":"ATAN(P92/O92)*180/PI()","v":14.437960029796415}]
[null,null,null,null,null,null,null,null,null,null,null,null,null,null,null,null,{"$f":"MAX(Q69:Q91)","v":3.4999999999968168E-2},{"$f":"MAX(R69:R91)","v":3.2557641093797024E-2},{"$f":"R93*100","v":3.2557641093797023}]
[null,null,null,null,null,null,null,null,null,null,null,null,null,null,null,null,{"$f":"MIN(Q69:Q91)","v":-1.1000000000024102E-2}]

{"sheet":"Downcutting","index":4,"n_rows":36,"n_cols":28,"rows_kept":36,"cut":false,"hidden":false,"merged":[[0,6,0,8],[0,9,0,11]]}
[null,null,null,null,null,null,"2006-2012",null,null,"2012-2014"]
["From","To","Downcutting 2006-2014","Downcutting 2006-2012",null,"Creek Segment","Upper","Mid","Lower","Upper","Mid","Lower"]
["0+000","0+100",-2.5,-1,null,"Max Downcutting (m)",4.5599999999999996,4.24,"No 2012 data",2.4500000000000002,1.34,"No 2012 data"]
[{"$f":"B3","v":"0+100"},"0+200",-5.4,-3.9,null,"Downcutting Station","0+200","0+200","No 2012 data","0+194.1","0+864.2","No 2012 data"]
[{"$f":"B4","v":"0+200"},"0+300",-25.7,-26,null,"Max Deposition (m)",0.35,0.79,"No 2012 data",1.21,0.64,"No 2012 data",null,null,null,null,null,null,null,null,"Days","Yrs"]
["0+300","0+400",-15.9,-15.2,null,"Deposition Station","0+036.6","0+833","No 2012 data","0+197.3","0+379.4","No 2012 data",null,null,{"$f":"(0.4*220+0.9*260)/480","v":0.67083333333333328},null,null,null,null,"2004-2010",{"$f":"[1]Bearing!C324-[1]Bearing!C319","v":2250},{"$f":"U6/365","v":6.1643835616438354}]
["0+400","0+500",-6.4,-1.7,null,"Average Downcutting",3.95,6.83,"No 2012 data",1.54,1.22,"No 2012 data",null,null,null,null,null,null,null,"2010 to 2012",681,{"$f":"U7/365","v":1.8657534246575342}]
["0+500","0+600",-6.5,-5.8,null,"Average Deposition",0.27,0.39,"No 2012 data",{"$f":"0.6","v":0.6},0.35,"No 2012 data",null,null,null,null,null,null,null,"2012 to 2014",766,{"$f":"U8/365","v":2.0986301369863014}]
["0+600","0+700",-3.1,4.3,null,"Avg Horiz. Invert Shift",2.2999999999999998,28.3,"No 2012 data",1.47,2.9,"No 2012 data",null,null,null,null,null,null,null,"2003-2012",3273,{"$f":"U9/365","v":8.9671232876712335}]
["0+700","0+800",-2.1,3.1,null,"Max Horiz Invert Shift",7.3,66.400000000000006,"No 2012 data",3.9,13.6,"No 2012 data",null,null,null,null,null,null,null,"2003-2014",4041,{"$f":"U10/365","v":11.07123287671233}]
["0+800","0+900",-7.3,3.1,null,null,null,null,null,null,null,null,null,null,null,null,null,null,null,"2014 to 2015",null,{"$f":"'Clinton Movement'!H62","v":1.0164383561643835}]
[]
["Average",null,{"$f":"AVERAGE(C3:C11)","v":-8.3222222222222211},{"$f":"AVERAGE(D3:D11)","v":-4.7888888888888879}]
["Max",null,{"$f":"MAX(C3:C11)","v":-2.1},{"$f":"MAX(D3:D11)","v":4.3}]
["Min",null,{"$f":"MIN(C3:C11)","v":-25.7},{"$f":"MIN(D3:D11)","v":-26}]
["Downcutting (2004-2010)",null,null,null,null,null,"Deposition (2004-2010)",null,null,null,null,null,"Horizontal Shift 2004-2010",null,null,null,null,null,null,"Average Downcutting",null,null,null,null,null,"RPC"]
["From",null,"Length","Area","Depth",null,"From",null,"Length","Area","Depth",null,"From","Length","Length","Area","Shift",null,null,null,"2004-2010","2010-2012","2012 to 2014","2014 to 2015",null,"2004-2010","2012 to 2014","2014-04-01"]
[200,420,{"$f":"B18-A18","v":220},381,{"$f":"D18/C18","v":1.7318181818181819},{"$f":"(E18*C18+E19*C19)/480","v":0.8504166666666666},200,420,0,0,0,null,200,420,{"$f":"N18-M18","v":220},{"$f":"2000-152","v":1848},{"$f":"P18/O18","v":8.4},"South",null,"Upper Creek",{"$f":"(E18*C18+E19*C19)/480/V6*100","v":13.795648148148148},{"$f":"(E23*C23+E24*C24)/480/V7*100","v":5.0917767988252569},{"$f":"(E28*C28+E29*C29)/480/V8*100","v":6.4625489556135784},{"$f":"(C34*E34+C35*E35)/450/V11*100","v":3.9571728062294107},null,{"$f":"(V18-U18)/U18","v":-0.63091427498397401},{"$f":"(W18-V18)/V18","v":0.26921293115294792},{"$f":"(X18-W18)/W18","v":-0.38767615790483367}]
[420,680,{"$f":"260-I19","v":72},27.2,{"$f":"D19/C19","v":0.37777777777777777},null,420,680,188,135,{"$f":"J19/I19","v":0.71808510638297873},null,420,680,{"$f":"N19-M19","v":260},229,{"$f":"P19/O19","v":0.88076923076923075},null,null,"Mid Creek","N/A",{"$f":"(E25*C25)/233/V7*100","v":10.098441448765699},{"$f":"(E30*C30)/233/V8*100","v":30.901007407075383},{"$f":"C36*E36/(B36-A36)/V11*100","v":3.7086690845458024},null,null,{"$f":"(W19-V19)/V19","v":2.0599778751851177},{"$f":"(X19-W19)/W19","v":-0.87998225961731491}]
["Max",null,"Sta",null,null,null,null,null,null,null,null,null,"Max",null,"Sta"]
["Downcutting (2010-2012)",null,null,null,null,null,"Deposition (2010-2012)",null,null,null,null,null,"Horizontal Shift 2010-2012",null,null,null,null,null,null,"Average Deposition"]
["From",null,"Length","Area","Depth",null,"From",null,"Length","Area","Depth",null,"From","Length","Length","Area","Shift",null,null,null,"2006-2010","2010-2012","2012 to 2014","2014 to 2015"]
[200,420,76.5,10.8,{"$f":"D23/C23","v":0.14117647058823529},null,200,420,{"$f":"C18-C23","v":143.5},18.829999999999998,{"$f":"J23/I23","v":0.13121951219512193},null,200,420,{"$f":"N23-M23","v":220},397.5,{"$f":"P23/O23","v":1.8068181818181819},null,null,"Upper Creek",{"$f":"(K19*I19)/480/V6*100","v":4.5625},{"$f":"(K23*I23+K24*I24)/480/V7*100","v":4.6127477973568283},{"$f":"(K28*I28+K29*I29)/480/V8*100","v":2.2038185378590081},{"$f":"(I34*K34+I35*K35)/450/V11*100","v":13.314465408805029},null,{"$f":"(V23-U23)/U23","v":1.1013215859030855E-2},{"$f":"(W23-V23)/V23","v":-0.52223303014272138},{"$f":"(X23-W23)/W23","v":5.0415434302226734}]
[420,680,156.69999999999999,34.799999999999997,{"$f":"D24/C24","v":0.22208040842373963},null,420,680,{"$f":"H24-G24-C24","v":103.30000000000001},22.48,{"$f":"J24/I24","v":0.21761858664085187},null,420,680,{"$f":"N24-M24","v":260},91.8,{"$f":"P24/O24","v":0.35307692307692307},null,null,"Mid Creek","N/A",{"$f":"K25*I25/233/V7*100","v":0.20472922299319987},{"$f":"K30*I30/233/V8*100","v":0.51126749515346426},{"$f":"(I36*K36)/(H36-G36)/V11*100","v":8.1899775617053105},null,null,{"$f":"(W24-V24)/V24","v":1.4972863555020972},{"$f":"(X24-W24)/W24","v":15.018967838444279}]
[680,913,222.4,43.9,{"$f":"D25/C25","v":0.19739208633093525},null,680,913,{"$f":"B25-A25-C25","v":10.599999999999994},0.89,{"$f":"J25/I25","v":8.3962264150943447E-2},null,680,913,{"$f":"N25-M25","v":233},232.5,{"$f":"P25/O25","v":0.99785407725321884}]
["Downcutting (2012-2014)",null,null,null,null,null,"Deposition (2012-2014)",null,null,null,null,null,"Horizontal Shift 2012-2014",null,null,null,null,null,null,"Average Shift"]
["From",null,"Length","Area","Depth",null,"From",null,"Length","Area","Depth",null,"From","Length","Length","Area","Shift",null,null,null,"2006-2010","2010-2012","2012 to 2014","2014 to 2015"]
[200,420,99.3,11.9,{"$f":"D28/C28","v":0.11983887210473314},null,200,420,{"$f":"C18-C28","v":120.7},17.100000000000001,{"$f":"J28/I28","v":0.14167357083678542},null,200,420,{"$f":"O23","v":220},163.19999999999999,{"$f":"P28/O28","v":0.74181818181818182},null,null,"Upper Creek",{"$f":"(Q18*O18+Q19*O19)/480/V6","v":0.70194907407407414},{"$f":"(Q23*O23+Q24*O24)/480/V7","v":0.54636104992657852},{"$f":"(Q28*O28+Q29*O29)/480/V8","v":0.51144473455178419},{"$f":"(O34*Q34+O35*Q35)/450/V11","v":0.70179694519317171},null,{"$f":"(V28-U28)/U28","v":-0.22165144152761854},{"$f":"(W28-V28)/V28","v":-6.3907036161319486E-2},{"$f":"(W28-U28)/U28","v":-0.27139339100002391}]
[420,680,222.6,53.2,{"$f":"D29/C29","v":0.23899371069182393},null,420,680,{"$f":"H29-G29-C29","v":37.400000000000006},5.0999999999999996,{"$f":"J29/I29","v":0.13636363636363633},null,420,680,{"$f":"N29-M29","v":260},352,{"$f":"P29/O29","v":1.3538461538461539},null,null,"Mid Creek","N/A",{"$f":"Q25/V7","v":0.53482634096538162},{"$f":"Q30/V8","v":0.55503199273860071},{"$f":"Q36/V11","v":0.39147062559094564},null,null,{"$f":"(W29-V29)/V29","v":3.7779836604059425E-2}]
[680,913,224.7,151.1,{"$f":"D30/C30","v":0.67245215843346684},null,680,913,{"$f":"B30-A30-C30","v":8.3000000000000114},2.5,{"$f":"J30/I30","v":0.30120481927710802},null,680,913,{"$f":"N30-M30","v":233},271.39999999999998,{"$f":"P30/O30","v":1.1648068669527896}]
[]
["Downcutting (2014-2015)",null,null,null,null,null,"Deposition (2014-2015)",null,null,null,null,null,"Horizontal Shift 2014-2015"]
["From",null,"Length","Area","Depth",null,"From",null,"Length","Area","Depth",null,"From","Length","Length","Area","Shift"]
[230,420,{"$f":"B34-A34-I34","v":95.1},10.3,{"$f":"D34/C34","v":0.10830704521556259},null,230,420,94.9,11.1,{"$f":"J34/I34","v":0.11696522655426764},null,230,420,{"$f":"N34-M34","v":190},{"$f":"195-119","v":76},{"$f":"P34/O34","v":0.4},"south"]
[420,680,69.8,7.8,{"$f":"D35/C35","v":0.11174785100286533},null,420,680,{"$f":"H35-G35-C35","v":190.2},49.8,{"$f":"J35/I35","v":0.26182965299684541},null,420,680,{"$f":"N35-M35","v":260},245,{"$f":"P35/O35","v":0.94230769230769229},"south"]
[680,871,101.2,7.2,{"$f":"D36/C36","v":7.1146245059288543E-2},null,680,871,{"$f":"H36-G36-C36","v":89.8},15.9,{"$f":"J36/I36","v":0.17706013363028955},null,680,871,{"$f":"N36-M36","v":191},76,{"$f":"P36/O36","v":0.39790575916230364},"south"]

{"sheet":"Drop Structures - TF","index":5,"n_rows":101,"n_cols":30,"rows_kept":101,"cut":false,"hidden":false,"merged":[]}
["Point","Date","Northing","Easting","Distance",null,"dn","de","Movement","Timeframe","Average",null,"Period","Duration","DS-1 US","DS-1 DS","DS-1","DS-2 US","DS-2 DS","DS-2","DS-3 US","DS-3 DS","DS-3",null,null,null,null,null,null,26.5]
[1450,"2006-07-28",7147441.2999999998,512890.12,{"$f":"((C8-C2)^2+(D8-D2)^2)^0.5","v":27.579024638078618},null,{"$f":"C3-C2","v":-1.9999999552965164E-2},{"$f":"D3-D2","v":1.0000000009313226E-2},{"$f":"(G2^2+H2^2)^0.5*100","v":2.2360679379322788},"DS-A",{"$f":"(I2+I8)/2/$N$2","v":0.99136840978342944},null,"DS-A",{"$f":"(B3-B2)/365","v":3.9808219178082194},{"$f":"K2","v":0.99136840978342944},{"$f":"K14","v":1.3781736002707787},{"$f":"(O2+P2)/2","v":1.1847710050271041},{"$f":"K26","v":0.98358480281943694},{"$f":"K38","v":2.4744032245633889},{"$f":"(R2+S2)/2","v":1.728994013691413},{"$f":"K50","v":2.9776487141200509},{"$f":"K62","v":0.90573036740607649},{"$f":"(U2+V2)/2","v":1.9416895407630637},null,null,null,null,null,null,26.4]
[1450,"2010-07-20",7147441.2800000003,512890.13,null,null,{"$f":"C4-C3","v":-2.0000000484287739E-2},{"$f":"D4-D3","v":1.0000000009313226E-2},{"$f":"(G3^2+H3^2)^0.5*100","v":2.2360680212323021},"DS-B",{"$f":"(I3+I9)/2/$N$3","v":12.181564593280452},null,"DS-B",{"$f":"(B4-B3)/365","v":0.18356164383561643},{"$f":"K3","v":12.181564593280452},{"$f":"K15","v":5.447761199103474},{"$f":"(O3+P3)/2","v":8.8146628961919635},{"$f":"K27","v":12.181564593280452},{"$f":"K39","v":9.9429311755339231},{"$f":"(R3+S3)/2","v":11.062247884407189},{"$f":"K51","v":13.795080104917258},{"$f":"K63","v":7.7042976826522187},{"$f":"AVERAGE(I45,I51,I69)/N3","v":11.76481923131661},null,null,null,null,null,null,{"$f":"(AD2-AD1)/AD1","v":-3.7735849056604312E-3}]
[1450,"2010-09-25",7147441.2599999998,512890.14,null,null,{"$f":"C5-C4","v":-4.3999999761581421E-2},{"$f":"D5-D4","v":5.9999999939464033E-3},{"$f":"(G4^2+H4^2)^0.5*100","v":4.4407206385298794},"DS-C",{"$f":"(I4+I10)/2/$N$4","v":2.5565383129647263},null,"DS-C",{"$f":"(B5-B4)/365","v":1.8657534246575342},2.5565383129647263,1.0719530362356864,1.8142456746002065,3.7899262412040189,5.6762669446118919,4.7330965929079554,2.2739557389867406,0,{"$f":"(U4+V4)/2","v":1.1369778694933703}]
[1450,"2012-08-06",7147441.216,512890.14600000001,null,null,4.700000025331974E-2,-2.0000000367872417E-3,{"$f":"(G5^2+H5^2)^0.5*100","v":4.7042534200011001},"DS-D",{"$f":"(I5+I11)/2/$N$5","v":2.0264573770940046},null,"DS-D",{"$f":"(B6-B5)/365","v":2.0986301369863014},2.0264573770940046,1.5741716165588169,1.8003144968264109,1.9958027840654036,3.5816480968465219,2.7887254404559627,2.3978660403223926,2.0410888424804345,2.2194774414014136]
[1450,"2014-09-11",7147441.2630000003,512890.14399999997,null,null,-2.9000000096857548E-2,-7.999999972525984E-3,{"$f":"(G6^2+H6^2)^0.5*100","v":3.008321799904647},"DS-E",{"$f":"(I6+I12)/2/$N$6","v":1.6998253503683216},null,"DS-E",{"$f":"(B7-B6)/365","v":1.0164383561643835},1.6998253503683216,1.5558851464444197,1.6278552484063706,2.9133011512113307,5.4113029661457599,4.1623020586785451,5.2942422670773643,4.5352206877694261,4.9147314774233948]
[1450,"2015-09-17",7147441.2340000002,512890.136,{"$f":"((C13-C7)^2+(D13-D7)^2)^0.5","v":27.48907173789495},null,null,null,null,null,null,null,null,null,null,null,{"$f":"(Q6-Q5)/Q5","v":-9.5793956402645694E-2},null,null,{"$f":"(T6-T5)/T5","v":0.49254637917958666},null,null,{"$f":"(W6-W5)/W5","v":1.2143642398636656}]
[1451,"2006-07-28",7147413.79,512888.17,null,null,{"$f":"C9-C8","v":4.0000000037252903E-2},{"$f":"D9-D8","v":-3.9999999979045242E-2},{"$f":"(G8^2+H8^2)^0.5*100","v":5.6568542506448338},"DS-A"]
[1451,"2010-07-20",7147413.8300000001,512888.13,null,null,{"$f":"C10-C9","v":-2.0000000484287739E-2},{"$f":"D10-D9","v":1.0000000009313226E-2},{"$f":"(G9^2+H9^2)^0.5*100","v":2.2360680212323021},"DS-B",null,null,null,"DS-1","DS-2","DS-3"]
[1451,"2010-09-25",7147413.8099999996,512888.14,null,null,5.000000074505806E-2,-1.0000000009313226E-2,{"$f":"(G10^2+H10^2)^0.5*100","v":5.0990195868343857},"DS-C",null,null,"2006-07-28",{"$f":"Q2","v":1.1847710050271041},{"$f":"T2","v":1.728994013691413},{"$f":"W2","v":1.9416895407630637}]
[1451,"2012-08-06",7147413.8600000003,512888.13,null,null,-3.8000000640749931E-2,9.9999998928979039E-4,{"$f":"(G11^2+H11^2)^0.5*100","v":3.8013156257742855},"DS-D",null,null,"2010-07-20",{"$f":"Q2","v":1.1847710050271041},{"$f":"T2","v":1.728994013691413},{"$f":"W2","v":1.9416895407630637}]
[1451,"2014-09-11",7147413.8219999997,512888.13099999999,null,null,-3.9999997243285179E-3,1.9999999785795808E-3,{"$f":"(G12^2+H12^2)^0.5*100","v":0.44721356988520089},"DS-E",null,null,"2010-07-20",{"$f":"Q3","v":8.8146628961919635},{"$f":"T3","v":11.062247884407189},{"$f":"W3","v":11.76481923131661}]
[1451,"2015-09-17",7147413.818,512888.13299999997,null,null,null,null,null,null,null,null,"2010-09-25",{"$f":"Q3","v":8.8146628961919635},{"$f":"T3","v":11.062247884407189},{"$f":"W3","v":11.76481923131661}]
[1452,"2006-07-28",7147411.8799999999,512892.07,{"$f":"((C20-C14)^2+(D20-D14)^2)^0.5","v":28.823174704125943},null,{"$f":"C15-C14","v":4.9999999813735485E-2},{"$f":"D15-D14","v":-5.9999999997671694E-2},{"$f":"(G14^2+H14^2)^0.5*100","v":7.8102496638034253},"DS-A",{"$f":"(I14+I20)/2/$N$2","v":1.3781736002707787},null,"2010-09-25",{"$f":"Q4","v":1.8142456746002065},{"$f":"T4","v":4.7330965929079554},{"$f":"W4","v":1.1369778694933703}]
[1452,"2010-07-20",7147411.9299999997,512892.01,null,null,{"$f":"C16-C15","v":0},{"$f":"D16-D15","v":-1.0000000009313226E-2},{"$f":"(G15^2+H15^2)^0.5*100","v":1.0000000009313226},"DS-B",{"$f":"(I15+I21)/2/$N$3","v":5.447761199103474},null,"2012-08-06",{"$f":"Q4","v":1.8142456746002065},{"$f":"T4","v":4.7330965929079554},{"$f":"W4","v":1.1369778694933703}]
[1452,"2010-09-25",7147411.9299999997,512892,null,null,2.0000000484287739E-2,0,{"$f":"(G16^2+H16^2)^0.5*100","v":2.0000000484287739},"DS-C",{"$f":"(I16+I22)/$N$4","v":1.0719530362356864},null,"2012-08-06",{"$f":"Q5","v":1.8003144968264109},{"$f":"T5","v":2.7887254404559627},{"$f":"W5","v":2.2194774414014136}]
[1452,"2012-08-06",7147411.9500000002,512892,{"$f":"((C23-C17)^2+(D23-D17)^2)^0.5","v":28.688584837278277},null,-2.199999988079071E-2,-2.7999999991152436E-2,{"$f":"(G17^2+H17^2)^0.5*100","v":3.5608987548922646},"DS-D",{"$f":"(I17+I23)/2/$N$5","v":1.5741716165588169},null,"2014-09-11",{"$f":"Q5","v":1.8003144968264109},{"$f":"T5","v":2.7887254404559627},{"$f":"W5","v":2.2194774414014136}]
[1452,"2014-09-11",7147411.9280000003,512891.97200000001,null,null,1.0999999940395355E-2,7.999999972525984E-3,{"$f":"(G18^2+H18^2)^0.5*100","v":1.3601470444371577},"DS-E",{"$f":"(I18+I24)/2/$N$6","v":1.5558851464444197},null,"2014-09-11",{"$f":"Q6","v":1.6278552484063706},{"$f":"T6","v":4.1623020586785451},{"$f":"W6","v":4.9147314774233948}]
[1452,"2015-09-17",7147411.9390000002,512891.98,{"$f":"((C25-C19)^2+(D25-D19)^2)^0.5","v":28.661149522777894},null,null,null,null,null,null,null,"2015-09-17",{"$f":"Q6","v":1.6278552484063706},{"$f":"T6","v":4.1623020586785451},{"$f":"W6","v":4.9147314774233948}]
[1453,"2006-07-28",7147439.1100000003,512901.52,null,null,{"$f":"C21-C20","v":-3.0000000260770321E-2},{"$f":"D21-D20","v":-1.0000000009313226E-2},{"$f":"(G20^2+H20^2)^0.5*100","v":3.1622776852017345},"DS-A"]
[1453,"2010-07-20",7147439.0800000001,512901.51,null,null,{"$f":"C22-C21","v":0},{"$f":"D22-D21","v":-1.0000000009313226E-2},{"$f":"(G21^2+H21^2)^0.5*100","v":1.0000000009313226},"DS-B"]
[1453,"2010-09-25",7147439.0800000001,512901.5,null,null,null,null,null,"DS-C"]
[1453,"2012-08-06",7147439.0199999996,512901.5,null,"Reestablished",-2.7999999932944775E-2,-1.1999999987892807E-2,{"$f":"(G23^2+H23^2)^0.5*100","v":3.0463092357052899},"DS-D"]
[1453,"2014-09-11",7147438.9919999996,512901.48800000001,null,null,-1.6999999992549419E-2,5.9999999939464033E-3,{"$f":"(G24^2+H24^2)^0.5*100","v":1.8027756368279362},"DS-E"]
[1453,"2015-09-17",7147438.9749999996,512901.49400000001]
[1454,"2006-07-28",7147423.2400000002,512948.59,{"$f":"((C32-C26)^2+(D32-D26)^2)^0.5","v":27.622499886841798},null,{"$f":"C27-C26","v":0},{"$f":"D27-D26","v":-2.0000000018626451E-2},{"$f":"(G26^2+H26^2)^0.5*100","v":2.0000000018626451},"DS-A",{"$f":"(I26+I32)/2/$N$2","v":0.98358480281943694}]
[1454,"2010-07-20",7147423.2400000002,512948.57,null,null,{"$f":"C28-C27","v":-2.0000000484287739E-2},{"$f":"D28-D27","v":1.0000000009313226E-2},{"$f":"(G27^2+H27^2)^0.5*100","v":2.2360680212323021},"DS-B",{"$f":"(I27+I33)/2/$N$3","v":12.181564593280452}]
[1454,"2010-09-25",7147423.2199999997,512948.58,null,null,null,null,null,"DS-C",{"$f":"(I28+I34)/$N$4","v":3.7899262412040189}]
[1454,"2012-08-06",7147423.1699999999,512948.56,{"$f":"((C35-C29)^2+(D35-D29)^2)^0.5","v":27.448642953314867},"Reestablished",3.2999999821186066E-2,1.6999999992549419E-2,{"$f":"(G29^2+H29^2)^0.5*100","v":3.7121422224168086},"DS-D",{"$f":"(I29+I35)/2/$N$5","v":1.9958027840654036}]
[1454,"2014-09-11",7147423.2029999997,512948.57699999999,null,null,-2.3000000044703484E-2,-1.5000000013969839E-2,{"$f":"(G30^2+H30^2)^0.5*100","v":2.7459060480567348},"DS-E",{"$f":"(I30+I36)/2/$N$6","v":2.9133011512113307},null,null,null,"1900-01-01"]
[1454,"2015-09-17",7147423.1799999997,512948.56199999998,{"$f":"((C37-C31)^2+(D37-D31)^2)^0.5","v":27.481247223983051},null,null,null,null,null,null,null,null,null,{"$f":"B7-O30","v":42263}]
[1455,"2006-07-28",7147397.0300000003,512939.87,null,null,{"$f":"C33-C32","v":4.9999999813735485E-2},{"$f":"D33-D32","v":3.0000000027939677E-2},{"$f":"(G32^2+H32^2)^0.5*100","v":5.8309518803107352},"DS-A"]
[1455,"2010-07-20",7147397.0800000001,512939.9,null,null,{"$f":"C34-C33","v":-2.0000000484287739E-2},{"$f":"D34-D33","v":-1.0000000009313226E-2},{"$f":"(G33^2+H33^2)^0.5*100","v":2.2360680212323021},"DS-B"]
[1455,"2010-09-25",7147397.0599999996,512939.89,null,null,5.000000074505806E-2,4.9999999988358468E-2,{"$f":"(G34^2+H34^2)^0.5*100","v":7.0710678637258546},"DS-C"]
[1455,"2012-08-06",7147397.1100000003,512939.94,null,null,-4.0000000037252903E-2,-2.3999999975785613E-2,{"$f":"(G35^2+H35^2)^0.5*100","v":4.6647615178248305},"DS-D",null,null,2015]
[1455,"2014-09-11",7147397.0700000003,512939.91600000003,null,null,1.4999999664723873E-2,2.7999999991152436E-2,{"$f":"(G36^2+H36^2)^0.5*100","v":3.1764760182413672},"DS-E",null,null,"Parameter","DS-1 US","DS-1 DS","DS-1","DS-2 US","DS-2 DS","DS-2","DS-3 US","DS-3 DS","DS-3"]
[1455,"2015-09-17",7147397.085,512939.94400000002,null,null,null,null,null,null,null,null,"Bottom Width",6.5,6.37,{"$f":"(N37+O37)/2","v":6.4350000000000005},6.9,6.4,{"$f":"(Q37+R37)/2","v":6.65},7.06,5.7,{"$f":"(T37+U37)/2","v":6.38}]
[1456,"2006-07-28",7147392.7000000002,512951.21,{"$f":"((C44-C38)^2+(D44-D38)^2)^0.5","v":28.617199373617243},null,{"$f":"C39-C38","v":0.16000000014901161},{"$f":"D39-D38","v":7.0000000006984919E-2},{"$f":"(G38^2+H38^2)^0.5*100","v":17.464249210504757},"DS-A",{"$f":"(I38+I44)/2/$N$2","v":2.4744032245633889},null,"Left Side Slope",3.3,3.9,null,2.5,2.9,null,2.7,3.2]
[1456,"2010-07-20",7147392.8600000003,512951.28,null,null,{"$f":"C40-C39","v":-1.0000000707805157E-2},{"$f":"D40-D39","v":-1.0000000009313226E-2},{"$f":"(G39^2+H39^2)^0.5*100","v":1.414213613081023},"DS-B",{"$f":"(I39+I45)/2/$N$3","v":9.9429311755339231},null,"Right Side Slope",3,4,null,3.56,3.5,null,3.2,4.0999999999999996]
[1456,"2010-09-25",7147392.8499999996,512951.27,null,null,0.15000000037252903,3.9999999979045242E-2,{"$f":"(G40^2+H40^2)^0.5*100","v":15.524174731715155},"DS-C",{"$f":"(I40+I46)/2/$N$4","v":5.6762669446118919},null,"Average",null,null,{"$f":"AVERAGE(N38:O39)","v":3.55},null,null,{"$f":"AVERAGE(Q38:R39)","v":3.1150000000000002},null,null,{"$f":"AVERAGE(T38:U39)","v":3.3000000000000003}]
[1456,"2012-08-06",7147393,512951.31,null,null,9.4999999739229679E-2,2.1000000007916242E-2,{"$f":"(G41^2+H41^2)^0.5*100","v":9.7293370538727455},"DS-D",{"$f":"(I41+I47)/2/$N$5","v":3.5816480968465219},null,"US Invert",null,null,411.11,null,null,409.54,null,null,406.66]
[1456,"2014-09-11",7147393.0949999997,512951.33100000001,null,null,6.6000000573694706E-2,2.2999999986495823E-2,{"$f":"(G42^2+H42^2)^0.5*100","v":6.9892775557324303},"DS-E",{"$f":"(I42+I48)/2/$N$6","v":5.4113029661457599},null,"DS Invert",null,null,409.79,null,null,406.97,null,null,404.53]
[1456,"2015-09-17",7147393.1610000003,512951.35399999999,{"$f":"((C49-C43)^2+(D49-D43)^2)^0.5","v":28.07355212629113},null,null,null,null,null,null,null,"End Area",{"$f":"64.3/2","v":32.15},{"$f":"43.4/2","v":21.7},{"$f":"AVERAGE(N43:O43)","v":26.924999999999997},{"$f":"65.4/2","v":32.700000000000003},{"$f":"61.5/2","v":30.75},{"$f":"AVERAGE(Q43:R43)","v":31.725000000000001},{"$f":"66.1/2","v":33.049999999999997},{"$f":"62/2","v":31},{"$f":"AVERAGE(T43:U43)","v":32.024999999999999}]
[1457,"2006-07-28",7147420.5,512958,null,{"$f":"((C44-C38)^2+(D44-D38)^2)^0.5","v":28.617199373617243},{"$f":"C45-C44","v":-9.9999997764825821E-3},{"$f":"D45-D44","v":2.0000000018626451E-2},{"$f":"(G44^2+H44^2)^0.5*100","v":2.2360679691697873},"DS-A"]
[1457,"2010-07-20",7147420.4900000002,512958.02,null,28.440191630748529,{"$f":"C46-C45","v":-9.9999997764825821E-3},{"$f":"D46-D45","v":-2.0000000018626451E-2},{"$f":"(G45^2+H45^2)^0.5*100","v":2.2360679691697873},"DS-B",null,null,2014]
[1457,"2010-09-25",7147420.4800000004,512958,null,28.437823405546325,-4.0000000037252903E-2,-3.9999999979045242E-2,{"$f":"(G46^2+H46^2)^0.5*100","v":5.6568542506448338},"DS-C",null,null,"Parameter","DS-1 US","DS-1 DS","DS-1","DS-2 US","DS-2 DS","DS-2","DS-3 US","DS-3 DS","DS-3"]
[1457,"2012-08-06",7147420.4400000004,512957.96,null,28.234307146144005,3.7999999709427357E-2,3.699999995296821E-2,{"$f":"(G47^2+H47^2)^0.5*100","v":5.3037722183707388},"DS-D",null,null,"Bottom Width",7.7,9.8000000000000007,8.1999999999999993,null,null,7.7,null,null,7.8]
[1457,"2014-09-11",7147420.4780000001,512957.99699999997,null,28.182694069595044,-4.0000000037252903E-2,-2.9999999678693712E-3,{"$f":"(G48^2+H48^2)^0.5*100","v":4.0112342275008679},"DS-E",null,null,"Left Side Slope"]
[1457,"2015-09-17",7147420.4380000001,512957.99400000001,null,28.07355212629113,null,null,null,null,null,null,"Right Side Slope"]
[1458,"2006-07-28",7147412.1699999999,512986.91,{"$f":"((C56-C50)^2+(D56-D50)^2)^0.5","v":27.272528302192264},null,{"$f":"C51-C50","v":-1.9999999552965164E-2},{"$f":"D51-D50","v":1.0000000009313226E-2},{"$f":"(G50^2+H50^2)^0.5*100","v":2.2360679379322788},"DS-A",{"$f":"(I50+I56)/2/$N$2","v":2.9776487141200509},null,"Average",null,null,3.7,null,null,3.5,null,null,3.6]
[1458,"2010-07-20",7147412.1500000004,512986.92,null,null,{"$f":"C52-C51","v":-2.0000000484287739E-2},{"$f":"D52-D51","v":-1.9999999960418791E-2},{"$f":"(G51^2+H51^2)^0.5*100","v":2.8284271561916907},"DS-B",{"$f":"(I51+I57)/2/$N$3","v":13.795080104917258},null,"US Invert",null,null,411.15,null,null,409.5,null,null,406.69]
[1458,"2010-09-25",7147412.1299999999,512986.9,null,null,-3.0000000260770321E-2,-3.0000000027939677E-2,{"$f":"(G52^2+H52^2)^0.5*100","v":4.2426407075341652},"DS-C",{"$f":"(I52+I58)/$N$4","v":2.2739557389867406},null,"DS Invert",null,null,409.9,null,null,406.99,null,null,404.42]
[1458,"2012-08-06",7147412.0999999996,512986.87,{"$f":"((C59-C53)^2+(D59-D53)^2)^0.5","v":26.465887477709426},null,4.3000000528991222E-2,2.3999999975785613E-2,{"$f":"(G53^2+H53^2)^0.5*100","v":4.9244289459093169},"DS-D",{"$f":"(I53+I59)/2/$N$5","v":2.3978660403223926},null,"End Area",{"$f":"66.3/2","v":33.15},22.2,{"$f":"AVERAGE(N53:O53)","v":27.674999999999997},{"$f":"67.6/2","v":33.799999999999997},{"$f":"58/2","v":29},{"$f":"AVERAGE(Q53:R53)","v":31.4},{"$f":"66.1/2","v":33.049999999999997},{"$f":"59/2","v":29.5},{"$f":"AVERAGE(T53:U53)","v":31.274999999999999}]
[1458,"2014-09-11",7147412.1430000002,512986.89399999997,null,null,-5.0999999977648258E-2,2.0000000367872417E-3,{"$f":"(G54^2+H54^2)^0.5*100","v":5.1039200599806334},"DS-E",{"$f":"(I54+I60)/2/$N$6","v":5.2942422670773643}]
[1458,"2015-09-17",7147412.0920000002,512986.89600000001,{"$f":"((C61-C55)^2+(D61-D55)^2)^0.5","v":26.367797708389006},null,null,null,null,null,null,null,2006]
[1459,"2006-07-28",7147385.79,512979.99,null,null,{"$f":"C57-C56","v":0.19000000040978193},{"$f":"D57-D56","v":0.1000000000349246},{"$f":"(G56^2+H56^2)^0.5*100","v":21.47091059147284},"DS-A",null,null,"Parameter",null,null,"DS-1",null,null,"DS-2",null,null,"DS-3"]
[1459,"2010-07-20",7147385.9800000004,512980.09,null,null,{"$f":"C58-C57","v":-1.0000000707805157E-2},{"$f":"D58-D57","v":1.9999999960418791E-2},{"$f":"(G57^2+H57^2)^0.5*100","v":2.2360680056135487},"DS-B",null,null,"Bottom Width",null,null,6.9,null,null,6.3,null,null,6.3]
[1459,"2010-09-25",7147385.9699999997,512980.11,null,null,null,null,null,"DS-C",null,null,"Left Side Slope"]
[1459,"2012-08-06",7147386.46,512980.31,null,"Reestablished",4.1000000201165676E-2,3.1000000017229468E-2,{"$f":"(G59^2+H59^2)^0.5*100","v":5.1400389274438503},"DS-D",null,null,"Right Side Slope"]
[1459,"2014-09-11",7147386.5010000002,512980.34100000001,null,null,4.1000000201165676E-2,3.8999999989755452E-2,{"$f":"(G60^2+H60^2)^0.5*100","v":5.6586217541875961},"DS-E",null,null,"Average",null,null,3.2,null,null,3.1,null,null,3.2]
[1459,"2015-09-17",7147386.5420000004,512980.38,null,null,null,null,null,null,null,null,"US Invert",null,null,406.7,null,null,409.76,null,null,406.97]
[1460,"2006-07-28",7147382.4800000004,512988.03,{"$f":"((C68-C62)^2+(D68-D62)^2)^0.5","v":28.825159149136855},null,null,null,{"$f":"(G62^2+H62^2)^0.5*100","v":0},"DS-A",{"$f":"(I62+I68)/$N$2","v":0.90573036740607649},null,"DS Invert",null,null,409.76,null,null,407.14,null,null,404.83]
[1460,"2010-07-20","n.a","n.a",null,null,null,null,{"$f":"(G63^2+H63^2)^0.5*100","v":0},"DS-B",{"$f":"(I63+I69)/$N$3","v":7.7042976826522187},null,"End Area",null,null,30.6,null,null,34.5,null,null,36]
[1460,"2010-09-25","n.a","n.a",null,null,null,null,{"$f":"(G64^2+H64^2)^0.5*100","v":0},"DS-C",{"$f":"(I64+I70)/2/$N$4","v":0}]
[1460,"2012-08-06",7147381.5499999998,512988.49,{"$f":"((C71-C65)^2+(D71-D65)^2)^0.5","v":29.485918672975},"Reestablished",{"$f":"C66-C65","v":2.500000037252903E-2},{"$f":"D66-D65","v":2.8999999980442226E-2},{"$f":"(G65^2+H65^2)^0.5*100","v":3.8288379666579004},"DS-D",{"$f":"(I65+I71)/2/$N$5","v":2.0410888424804345},null,"Delta"]
[1460,"2014-09-11",7147381.5750000002,512988.51899999997,null,null,1.6389999995008111,0.42100000003119931,null,"DS-E",{"$f":"I72/N6","v":4.5352206877694261},null,"Parameter"]
[1460,"2015-09-17",7147383.2139999997,512988.94,{"$f":"((C73-C67)^2+(D73-D67)^2)^0.5","v":27.757293708457777},"Reestablished","Replaced in 2015",null,null,null,null,null,"Bottom Width",null,null,{"$f":"(P37-P47)/P47","v":-0.21524390243902425},null,null,{"$f":"(S37-S47)/S47","v":-0.13636363636363633},null,null,{"$f":"(V37-V47)/V47","v":-0.18205128205128204}]
[1461,"2006-07-28",7147410.21,512995.9,null,null,{"$f":"C69-C68","v":-3.0000000260770321E-2},{"$f":"D69-D68","v":-2.0000000018626451E-2},{"$f":"(G68^2+H68^2)^0.5*100","v":3.6055512981946007},"DS-A",null,null,"Left Side Slope"]
[1461,"2010-07-20",7147410.1799999997,512995.88,null,null,{"$f":"C70-C69","v":-9.9999997764825821E-3},{"$f":"D70-D69","v":1.0000000009313226E-2},{"$f":"(G69^2+H69^2)^0.5*100","v":1.4142135472265716},"DS-B",null,null,"Right Side Slope"]
[1461,"2010-09-25",7147410.1699999999,512995.89,null,null,null,null,null,"DS-C",null,null,"Average",null,null,{"$f":"(P40-P50)/P50","v":-4.0540540540540633E-2},null,null,{"$f":"(S40-S50)/S50","v":-0.10999999999999995},null,null,{"$f":"(V40-V50)/V50","v":-8.3333333333333287E-2}]
[1461,"2012-08-06",7147410.0999999996,512995.86,null,"Reestablished",3.300000075250864E-2,3.3999999985098839E-2,{"$f":"(G71^2+H71^2)^0.5*100","v":4.7381431475339495},"DS-D",null,null,"US Invert",null,null,{"$f":"P41-P51","v":-3.999999999996362E-2},null,null,{"$f":"S41-S51","v":4.0000000000020464E-2},null,null,{"$f":"V41-V51","v":-2.9999999999972715E-2}]
[1461,"2014-09-11",7147410.1330000004,512995.89399999997,null,null,-4.2000000365078449E-2,-1.8999999971129E-2,{"$f":"(G72^2+H72^2)^0.5*100","v":4.6097722607190601},"DS-E",null,null,"DS Invert",null,null,{"$f":"P42-P52","v":-0.1099999999999568},null,null,{"$f":"S42-S52","v":-1.999999999998181E-2},null,null,{"$f":"V42-V52","v":0.1099999999999568}]
[1461,"2015-09-17",7147410.091,512995.875,null,null,null,null,null,null,null,null,"End Area",null,null,{"$f":"(P43-P53)/P53","v":-2.7100271002710029E-2},null,null,{"$f":"(S43-S53)/S53","v":1.0350318471337671E-2},null,null,{"$f":"(V43-V53)/V53","v":2.3980815347721823E-2}]
[]
[null,null,null,null,null,null,null,null,null,null,null,null,2012]
[null,null,null,null,null,null,null,null,null,null,null,null,"US Invert",null,null,411.06,null,null,409.57,null,null,406.64]
[null,null,null,null,null,null,null,null,null,null,null,null,"DS Invert",null,null,409.66,null,null,406.9,null,null,404.49]
[null,null,{"$f":"C71-C65","v":28.549999999813735},{"$f":"D71-D65","v":7.3699999999953434},{"$f":"(C78^2+D78^2)^0.5","v":29.485918672975},null,null,null,null,null,null,null,null,"2012 to 2014","2014 to 2015"]
[null,null,null,null,null,null,null,null,null,null,null,null,"DS1 U/S",{"$f":"(P51-P76)/$N$5*100","v":4.2885117493460667},{"$f":"(P41-P51)/$N$6*100","v":-3.9353099730422434}]
[null,null,null,null,null,null,null,null,null,null,null,null,"DS1 D/S",{"$f":"(P52-P77)/$N$5*100","v":11.436031331590414},{"$f":"(P42-P52)/$N$6*100","v":-10.822102425871762}]
[null,null,null,null,null,null,null,null,null,null,null,null,"DS2 U/S",{"$f":"(S51-S76)/$N$5*100","v":-3.3355091383808757},{"$f":"(S41-S51)/$N$6*100","v":3.9353099730478354}]
[null,null,null,null,null,null,null,null,null,null,null,null,"DS2 D/S",{"$f":"(S52-S62)/$N$5*100","v":-7.1475195822443469},{"$f":"(S42-S52)/$N$6*100","v":-1.9676549865211217}]
[null,null,null,null,null,null,null,null,null,null,null,null,"DS3 U/S",{"$f":"(V51-V76)/$N$5*100","v":2.3825065274156851},{"$f":"(V41-V51)/$N$6*100","v":-2.9514824797816823}]
[null,null,null,null,null,null,null,null,null,null,null,null,"DS3 D/S",{"$f":"(V52-V77)/$N$5*100","v":-3.3355091383808757},{"$f":"(V42-V52)/$N$6*100","v":10.822102425871762}]
[]
[]
[null,null,null,null,null,null,null,null,null,null,null,null,"Elevation","Depth","Flow Elevation","Gabion Elevation","Freeboard"]
[null,null,null,null,null,null,null,null,null,null,null,"DS1 U/S",411.11,1.0474149816816016,{"$f":"M88+N88","v":412.1574149816816},413.43,{"$f":"P88-O88","v":1.2725850183184093}]
[null,null,null,null,null,null,null,null,null,null,null,"DS1 D/S",409.79,1.0073400329628448,{"$f":"M89+N89","v":410.79734003296289},411.56,{"$f":"P89-O89","v":0.76265996703710925}]
[null,null,null,null,null,null,null,null,null,null,null,"DS2 U/S",409.54,1.0256392181761909,410.56563921817622,411.82,1.2543607818237774]
[null,null,null,null,null,null,null,null,null,null,null,"DS2 D/S",406.97,0.94007428654760028,407.91007428654763,409.05,1.139925713452385]
[null,null,null,null,null,null,null,null,null,null,null,"DS3 U/S",406.66,1.0477033117304109,407.70770331173043,408.79,1.0822966882695937]
[null,null,null,null,null,null,null,null,null,null,null,"DS3 D/S",404.53,1.0055323996414298,405.5355323996414,406.46,0.92446760035858233]
[]
[null,null,null,null,null,null,null,null,"Flow",33.799999999999997,null,null,"Bottom Width","Left side slope","Right Side Slope","Area","Perimeter","Hydraulic Radius","Depth","Slope","Flow"]
[null,null,null,null,null,null,null,null,"Slope",0.01,null,"DS1 U/S",6.5,3.3,3,{"$f":"M96*S96+N96*S96*S96/2+O96*S96^2/2","v":10.263993534061282},{"$f":"M96+(S96^2+(N96*S96)^2)^0.5+(S96^2+(S96*O96)^2)^0.5","v":13.423900694942295},{"$f":"P96/Q96","v":0.76460588969705601},1.0474149816816016,1.9E-2,{"$f":"1/$J$97*T96^0.5*R96^(2/3)*P96","v":33.800014396502142}]
[null,null,null,null,null,null,null,null,"Roughness",3.5000000000000003E-2,null,"DS1 D/S",6.4,3.9,4,{"$f":"M97*S97+N97*S97*S97/2+O97*S97^2/2","v":10.45517528190007},{"$f":"M97+(S97^2+(N97*S97)^2)^0.5+(S97^2+(S97*O97)^2)^0.5","v":14.609085964272639},{"$f":"P97/Q97","v":0.71566252039784028},1.0073400329628448,0.02,{"$f":"1/$J$97*T97^0.5*R97^(2/3)*P97","v":33.800032723591805}]
[null,null,null,null,null,null,null,null,null,null,null,"DS2 U/S",6.9,2.5,3.6,10.285314813291974,13.493722474386708,0.76222960956957453,1.0256392181761909,1.9E-2,33.800014675252996]
[null,null,null,null,null,null,null,null,null,null,null,"DS2 D/S",6.4,2.9,3.5,8.8444423594341757,12.705667924668127,0.69610211850906634,0.94007428654760028,2.9000000000000001E-2,33.800001081643082]
[null,null,null,null,null,null,null,null,null,null,null,"DS3 U/S",7.1,2.7,3.2,10.676856090047984,13.629126669508882,0.78338519766892145,1.0477033117304109,1.7000000000000001E-2,33.80000097579299]
[null,null,null,null,null,null,null,null,null,null,null,"DS3 D/S",5.7,3.2,4.0999999999999996,9.4220329125157303,13.314696250776716,0.70764159655283865,1.0055323996414298,2.5000000000000001E-2,33.80042383308944]

{"sheet":"Drop Structures - All","index":6,"n_rows":122,"n_cols":45,"rows_kept":122,"cut":false,"hidden":false,"merged":[[6,34,9,34],[10,35,13,35],[10,36,13,36],[10,37,13,37],[0,10,0,12],[0,13,0,15],[2,29,5,29],[2,28,5,28],[6,28,9,28],[0,29,0,37],[2,34,5,34],[2,35,5,35],[2,36,5,36],[2,37,5,37],[6,29,9,29],[6,30,9,30],[6,31,9,31],[2,30,5,30],[2,31,5,31],[2,32,5,32],[2,33,5,33],[6,32,9,32],[6,33,9,33],[10,29,13,29],[10,30,13,30],[10,31,13,31],[10,32,13,32],[10,33,13,33],[6,35,9,35],[15,29,15,37],[17,28,20,28],[17,29,20,29],[17,30,20,30],[17,31,20,31],[17,32,20,32],[17,33,20,33],[17,34,20,34],[17,35,20,35],[17,36,20,36],[17,37,20,37],[6,36,9,36],[6,37,9,37],[10,28,13,28],[10,34,13,34],[21,28,24,28],[21,29,24,29],[21,30,24,30],[21,31,24,31],[21,32,24,32],[21,33,24,33],[21,34,24,34],[21,35,24,35],[21,36,24,36],[21,37,24,37],[25,28,28,28],[25,29,28,29],[25,30,28,30],[25,31,28,31],[25,32,28,32],[32,36,35,36],[32,37,35,37],[25,33,28,33],[25,34,28,34],[25,35,28,35],[25,36,28,36],[25,37,28,37],[36,35,39,35],[36,36,39,36],[36,37,39,37],[36,28,39,28],[36,29,39,29],[36,30,39,30],[36,31,39,31],[36,32,39,32],[40,35,43,35],[40,36,43,36],[40,37,43,37],[40,28,43,28],[40,29,43,29],[40,30,43,30],[40,31,43,31],[40,32,43,32],[15,16,25,16],[27,16,37,16],[39,16,49,16],[40,33,43,33],[40,34,43,34],[36,33,39,33],[36,34,39,34],[30,29,30,37],[32,28,35,28],[32,29,35,29],[32,30,35,30],[32,31,35,31],[32,32,35,32],[32,33,35,33],[32,34,35,34],[32,35,35,35]]}
[null,null,null,null,null,null,null,null,null,null,"Average",null,null,"Std.dev",null,null,null,null,null,null,null,null,null,null,null,null,null,null,null,"Standard deviation"]
["Point","Date","Northing","Easting","dn","de","movement",null,"Year","Duration","DS1","DS2","DS3","DS1","DS2","DS3","Point","2006-07-28","2007-07-04","2008-07-09","2010-07-20","2010-09-25","2011-08-11","2012-08-06","2013-09-12","2014-09-11","2015-09-17",null,"Point","2007-07-04","2008-07-09","2010-07-20","2010-09-25","2011-08-11","2012-08-06","2013-09-12","2014-09-11","2015-09-17",null,null,"Point"]
[1450,"2006-07-28",7147441.2999999998,512890.12,null,null,null,null,"2006-07-28",null,null,null,null,null,null,null,1450,null,{"$f":"INDIRECT(\"H\"&TEXT(3+VLOOKUP($Q3,$AO$3:$AP$14,2,TRUE)*10+VLOOKUP(S$2,$AR$3:$AS$12,2,FALSE)*1,0))","v":1.0703812077466692},1.3913421691043091,null,{"$f":"INDIRECT(\"H\"&TEXT(3+VLOOKUP($Q3,$AO$3:$AP$14,2,TRUE)*10+VLOOKUP(V$2,$AR$3:$AS$12,2,FALSE)*1,0))","v":12.181564593280452},2.281249949010089,2.5012746242211121,0.27238806206918326,4.7171771931329713,2.9596696953239792,null,"DS1",{"$f":"_xlfn.STDEV.S(S3:S6)","v":2.7527511782470824},{"$f":"_xlfn.STDEV.S(T3:T6)","v":0.94039702129028591},{"$f":"_xlfn.STDEV.S(U3:U6)","v":1.176030266707971},3.8877632022980917,0.38576384781980322,0.77275314567629405,0.74960171341148263,0.69496321520317184,1.0472108141024818,null,null,1450,0,null,"2006-07-28",0]
[1450,"2007-07-04",7147441.29,512890.12,{"$f":"C4-C3","v":-9.9999997764825821E-3},{"$f":"D4-D3","v":0},{"$f":"(E4^2+F4^2)^0.5","v":9.9999997764825821E-3},{"$f":"G4*100/$J$4","v":1.0703812077466692},"2007-07-04",{"$f":"(I4-I3)/365","v":0.9342465753424658},{"$f":"AVERAGE(G4,G14,G24,G34)/J4*100","v":3.4335025344787757},{"$f":"AVERAGE(G44,G54,G64,G74)/J4*100","v":2.5456965133472136},{"$f":"AVERAGE(G84,G94,G104,G114)/J4*100","v":5.4369404678574247},null,null,null,1451,null,1.0703812077466692,0.98382747127119752,{"$f":"INDIRECT(\"H\"&TEXT(3+VLOOKUP($Q4,$AO$3:$AP$14,2,TRUE)*10+VLOOKUP(U$2,$AR$3:$AS$12,2,FALSE)*1,0))","v":2.7864396781179002},12.181564593280452,1.6130874024205419,4.0443213334064572,1.6165771689864186,3.8117588005703689,0.43998100541266399,null,null,null,null,null,null,null,null,null,null,null,null,null,1451,1,null,"2007-07-04",1]
[1450,"2008-07-09",7147441.2800000003,512890.13,{"$f":"C5-C4","v":-9.9999997764825821E-3},{"$f":"D5-D4","v":1.0000000009313226E-2},{"$f":"(E5^2+F5^2)^0.5","v":1.4142135472265715E-2},{"$f":"G5*100/$J$5","v":1.3913421691043091},"2008-07-09",{"$f":"(I5-I4)/365","v":1.0164383561643835},{"$f":"AVERAGE(G5,G15,G25,G35)/J5*100","v":1.9215526270381649},{"$f":"AVERAGE(G45,G55,G65,G75)/J5*100","v":1.9867626698332395},3.6251015089523095,null,null,null,1452,null,6.2413414843143773,2.1999051397484926,2.0898297337527545,5.447761199103474,1.6130873273053083,3.1973167731264072,2.005749626494068,3.5706814437793311,1.3381500571955864,null,null,null,null,null,null,null,null,null,null,null,null,null,1452,2,null,"2008-07-09",2]
[1450,"2010-07-20",7147441.2800000003,512890.13,0,0,0,{"$f":"G6*100/$J$6","v":0},"2010-07-20",2.0301369863013701,1.3422117496753605,1.905972101845455,2.4350773056353678,null,null,null,1453,null,5.3519062381073876,3.1111357280286609,0.49257758683078839,{"$f":"INDIRECT(\"H\"&TEXT(3+VLOOKUP($Q6,$AO$3:$AP$14,2,TRUE)*10+VLOOKUP(V$2,$AR$3:$AS$12,2,FALSE)*1,0))","v":5.447761199103474},null,null,{"$f":"INDIRECT(\"H\"&TEXT(3+VLOOKUP($Q6,$AO$3:$AP$14,2,TRUE)*10+VLOOKUP(Y$2,$AR$3:$AS$12,2,FALSE)*1,0))","v":1.5029415278389748},3.0546782171220626,1.7736202356932527,null,null,null,null,null,null,null,null,null,null,null,null,null,1453,3,null,"2010-07-20",3]
[1450,"2010-09-25",7147441.2599999998,512890.14,-2.0000000484287739E-2,1.0000000009313226E-2,2.2360680212323021E-2,{"$f":"G7*100/$J$7","v":12.181564593280452},"2010-09-25",0.18356164383561643,8.8146628961919635,11.062247884407189,11.764819297495578,null,null,null,1454,null,{"$f":"INDIRECT(\"H\"&TEXT(3+VLOOKUP($Q7,$AO$3:$AP$14,2,TRUE)*10+VLOOKUP(S$2,$AR$3:$AS$12,2,FALSE)*1,0))","v":1.5137476385269752},null,0.69660991192671873,12.181564593280452,null,null,1.5111469223251068,3.7223404153355362,2.7014978639911273,null,"DS2",{"$f":"_xlfn.STDEV.S(S7:S10)","v":1.9905061289433823},{"$f":"_xlfn.STDEV.S(T7:T10)","v":0.77788441945846376},{"$f":"_xlfn.STDEV.S(U7:U10)","v":1.8888163401401346},{"$f":"_xlfn.STDEV.S(V7:V10)","v":2.2386332286637751},{"$f":"_xlfn.STDEV.S(W7:W10)","v":3.303692155313922},{"$f":"_xlfn.STDEV.S(X7:X10)","v":2.592526043089892},{"$f":"_xlfn.STDEV.S(Y7:Y10)","v":2.5989874508831918},{"$f":"_xlfn.STDEV.S(Z7:Z10)","v":2.6733338195492489},{"$f":"_xlfn.STDEV.S(AA7:AA10)","v":1.8816513477622001},null,null,1454,4,null,"2010-09-25",4]
[1450,"2011-08-11",7147441.2400000002,512890.14,-1.9999999552965164E-2,0,1.9999999552965164E-2,{"$f":"G8*100/$J$8","v":2.281249949010089},"2011-08-11",0.87671232876712324,1.3768561696839847,3.3213742843790204,1.298112460848126,null,null,null,1455,null,1.0703812326684243,{"$f":"INDIRECT(\"H\"&TEXT(3+VLOOKUP($Q8,$AO$3:$AP$14,2,TRUE)*10+VLOOKUP(T$2,$AR$3:$AS$12,2,FALSE)*1,0))","v":2.1999051141382258},1.5576671458820959,12.181564593280452,{"$f":"INDIRECT(\"H\"&TEXT(3+VLOOKUP($Q8,$AO$3:$AP$14,2,TRUE)*10+VLOOKUP(W$2,$AR$3:$AS$12,2,FALSE)*1,0))","v":3.6069729783846256},4.521688712174714,1.0933288541278401,4.6775767967199533,3.1251044384315341,null,null,null,null,null,null,null,null,null,null,null,null,null,1455,5,null,"2011-08-11",5]
[1450,"2012-08-06",7147441.216,512890.14600000001,-2.4000000208616257E-2,5.9999999939464033E-3,2.4738633954625246E-2,{"$f":"G9*100/$J$9","v":2.5012746242211121},"2012-08-06",0.989041095890411,2.4357281826884942,4.9889405602759247,10.266511292040144,null,null,null,1456,null,5.4578947667001145,3.547240451056505,4.6730014376462874,7.7042980414115432,8.0654367567109126,9.538512784713447,6.7665882191265032,9.7560660018229459,6.8762434173647904,null,null,null,null,null,null,null,null,null,null,null,null,null,1456,6,null,"2012-08-06",6]
[null,"2013-09-12",7147441.216,512890.14299999998,{"$f":"C10-C9","v":0},{"$f":"D10-D9","v":-3.0000000260770321E-3},{"$f":"(E10^2+F10^2)^0.5","v":3.0000000260770321E-3},{"$f":"G10*100/$J$10","v":0.27238806206918326},"2013-09-12",1.1013698630136985,1.349414096347161,2.9734553138288815,3.5227971347551232,null,null,null,1457,null,2.1407624154933385,2.1999051141382258,0.69660991192671873,12.181564309656304,1.6130874024205419,5.8955607442155342,2.5227572597360775,5.3183430211684604,3.9463625149267303,null,null,null,null,null,null,null,null,null,null,null,null,null,1457,7,null,"2013-09-12",7]
[1450,"2014-09-11",7147441.2630000003,512890.14399999997,{"$f":"C11-C9","v":4.700000025331974E-2},{"$f":"D11-D9","v":-2.0000000367872417E-3},4.7042534200010998E-2,{"$f":"G11*100/$J$11","v":4.7171771931329713},"2014-09-11",0.99726027397260275,3.7885739136511822,5.8685815587617238,{"$f":"AVERAGE(G91,G101,G109,G121)/J11*100","v":10.845491176284401},null,null,null,1458,null,1.0703812264379857,1.3913421650549702,0.69660991192671873,15.4085957016413,2.2812500552390702,5.8955608461562612,2.8855426401847728,4.9379575968596168,5.0213768784176045,null,"DS3",{"$f":"_xlfn.STDEV.S(S11:S14)","v":4.490375097260153},{"$f":"_xlfn.STDEV.S(T11:T14)","v":2.3206773413341937},{"$f":"_xlfn.STDEV.S(U11:U14)","v":2.6682120354595624},{"$f":"_xlfn.STDEV.S(V11:V14)","v":3.8690191805326273},{"$f":"_xlfn.STDEV.S(W11:W14)","v":0.47246239585806443},{"$f":"_xlfn.STDEV.S(X11:X14)","v":13.068254317851888},{"$f":"_xlfn.STDEV.S(Y11:Y14)","v":0.47045516185086494},{"$f":"_xlfn.STDEV.S(Z11:Z14)","v":1.8963456182415463},{"$f":"_xlfn.STDEV.S(AA11:AA14)","v":0.51623002587362188},null,null,1458,8,null,"2014-09-11",8]
[null,"2015-09-17",7147441.2340000002,512890.136,{"$f":"C12-C11","v":-2.9000000096857548E-2},{"$f":"D12-D11","v":-7.999999972525984E-3},{"$f":"(E12^2+F12^2)^0.5","v":3.0083217999046469E-2},{"$f":"G12*100/$J$12","v":2.9596696953239792},"2015-09-17",1.0164383561643835,1.6278552484063704,4.1623020586785451,{"$f":"AVERAGE(G92,G102,G111,G122)/J12*100","v":4.0677588399920008},null,null,null,1459,null,5.7641793212439794,4.9191374674526047,5.5071849904722443,12.181564508193214,null,null,3.9420532465715881,5.1541599135082565,5.5671076557371233,null,null,null,null,null,null,null,null,null,null,null,null,null,1459,9,null,"2015-09-17",9]
[1451,"2006-07-28",7147413.79,512888.17,null,null,null,null,"Stddev",null,{"$f":"_xlfn.STDEV.S(S3:AA6)","v":2.7992636440647338},{"$f":"_xlfn.STDEV.S(S7:AA10)","v":3.4503035045582733},{"$f":"_xlfn.STDEV.S(S11:AA14)","v":5.5263945506493402},null,null,null,1460,null,11.528358640174034,6.2222713691331935,null,null,null,{"$f":"INDIRECT(\"H\"&TEXT(3+VLOOKUP($Q13,$AO$3:$AP$14,2,TRUE)*10+VLOOKUP(X$2,$AR$3:$AS$12,2,FALSE)*1,0))","v":28.775850775751497},3.8026084339422841,1.1693941791600764,null,null,null,null,null,null,null,null,null,null,null,null,null,null,1460,10]
[1451,"2007-07-04",7147413.7999999998,512888.17,{"$f":"C14-C13","v":9.9999997764825821E-3},{"$f":"D14-D13","v":0},{"$f":"(E14^2+F14^2)^0.5","v":9.9999997764825821E-3},{"$f":"G14*100/$J$4","v":1.0703812077466692},null,null,null,null,null,null,null,null,1461,null,3.3848426835737038,1.9676550341684704,{"$f":"INDIRECT(\"H\"&TEXT(3+VLOOKUP($Q14,$AO$3:$AP$14,2,TRUE)*10+VLOOKUP(U$2,$AR$3:$AS$12,2,FALSE)*1,0))","v":1.1014370145071393},{"$f":"INDIRECT(\"H\"&TEXT(3+VLOOKUP($Q14,$AO$3:$AP$14,2,TRUE)*10+VLOOKUP(V$2,$AR$3:$AS$12,2,FALSE)*1,0))","v":7.7042976826522187},{"$f":"INDIRECT(\"H\"&TEXT(3+VLOOKUP($Q14,$AO$3:$AP$14,2,TRUE)*10+VLOOKUP(W$2,$AR$3:$AS$12,2,FALSE)*1,0))","v":1.6130873273053083},6.3946335462528143,3.4609842183218498,4.7511600243128891,{"$f":"INDIRECT(\"H\"&TEXT(3+VLOOKUP($Q14,$AO$3:$AP$14,2,TRUE)*10+VLOOKUP(AA$2,$AR$3:$AS$12,2,FALSE)*1,0))","v":4.5352206877694261},null,null,null,null,null,null,null,null,null,null,null,null,null,1461,11]
[1451,"2008-07-09",7147413.79,512888.17,{"$f":"C15-C14","v":-9.9999997764825821E-3},{"$f":"D15-D14","v":0},{"$f":"(E15^2+F15^2)^0.5","v":9.9999997764825821E-3},{"$f":"G15*100/$J$5","v":0.98382747127119752},null,null,null,null,null,null,null,null,null,null,39267,39638,40379,40446,40766,41127,41529,41893,42264]
[1451,"2010-07-20",7147413.8300000001,512888.13,4.0000000037252903E-2,-3.9999999979045242E-2,5.6568542506448334E-2,{"$f":"G16*100/$J$6","v":2.7864396781179002},null,null,null,null,null,null,null,null,"DS1","min",{"$f":"MIN(S3:S6)","v":1.0703812077466692},{"$f":"MIN(T3:T6)","v":0.98382747127119752},0.49257758683078839,5.447761199103474,1.6130873273053083,2.5012746242211121,0.27238806206918326,3.0546782171220626,0.43998100541266399,null,null,"Count"]
[1451,"2010-09-25",7147413.8099999996,512888.14,-2.0000000484287739E-2,1.0000000009313226E-2,2.2360680212323021E-2,{"$f":"G17*100/$J$7","v":12.181564593280452},null,null,null,null,null,null,null,null,null,"Q1",{"$f":"QUARTILE(S3:S6,1)","v":1.0703812077466692},{"$f":"QUARTILE(T3:T6,1)","v":1.2894634946460313},1.2912036602917714,5.447761199103474,1.6130873648629251,2.8492956986737594,1.195303161396527,3.4416806371150139,1.1136077942498559,null,"Point","2007-07-04","2008-07-09","2010-07-20","2010-09-25","2011-08-11","2012-08-06","2013-09-12","2014-09-11","2015-09-17"]
[1451,"2011-08-11",7147413.8200000003,512888.13,1.0000000707805157E-2,-1.0000000009313226E-2,1.414213613081023E-2,{"$f":"G18*100/$J$8","v":1.6130874024205419},null,null,null,null,null,null,null,null,null,"Average",{"$f":"AVERAGE(S3:S6)","v":3.4335025344787757},{"$f":"AVERAGE(T3:T6)","v":1.9215526270381651},1.7896156662338143,{"$f":"AVERAGE(V3:V6)","v":8.8146628961919635},1.835808226245313,3.2476375769179917,1.3494140963471613,3.7885739136511836,1.6278552484063706,null,"DS1",{"$f":"COUNT(S3:S6)","v":4},{"$f":"COUNT(T3:T6)","v":4},3,4,3,3,4,4,4]
[1451,"2012-08-06",7147413.8600000003,512888.13,4.0000000037252903E-2,0,4.0000000037252903E-2,{"$f":"G19*100/$J$9","v":4.0443213334064572},null,null,null,null,null,null,null,null,null,"Q3",{"$f":"QUARTILE(S3:S6,3)","v":5.5742650496591351},{"$f":"QUARTILE(T3:T6,3)","v":2.4277127868185344},2.4381347059353273,12.181564593280452,1.9471686757153155,3.6208190532664322,1.713870283363331,4.0381133987110198,2.0701326006009344]
[null,"2013-09-12",7147413.8710000003,512888.14399999997,1.0999999940395355E-2,1.3999999966472387E-2,1.7804493751576445E-2,{"$f":"G20*100/$J$10","v":1.6165771689864186},null,null,null,null,null,null,null,null,null,"Max",{"$f":"MAX(S3:S6)","v":6.2413414843143773},{"$f":"MAX(T3:T6)","v":3.1111357280286609},2.7864396781179002,12.181564593280452,2.281249949010089,4.0443213334064572,2.005749626494068,4.7171771931329713,2.9596696953239792]
[1451,"2014-09-11",7147413.8219999997,512888.13099999999,{"$f":"C21-C19","v":-3.8000000640749931E-2},{"$f":"D21-D19","v":9.9999998928979039E-4},3.8013156257742854E-2,{"$f":"G21*100/$J$11","v":3.8117588005703689},null,null,null,null,null,null,null,null,null,"Bottom",{"$f":"S17","v":1.0703812077466692},{"$f":"T17","v":1.2894634946460313},1.2912036602917714,5.447761199103474,1.6130873648629251,2.8492956986737594,1.195303161396527,3.4416806371150139,1.1136077942498559]
[null,"2015-09-17",7147413.818,512888.13299999997,{"$f":"C22-C21","v":-3.9999997243285179E-3},{"$f":"D22-D21","v":1.9999999785795808E-3},4.4721356988520087E-3,{"$f":"G22*100/$J$12","v":0.43998100541266399},null,null,null,null,null,null,null,null,null,"2Q Box",{"$f":"S18-S17","v":2.3631213267321067},{"$f":"T18-T17","v":0.63208913239213382},0.49841200594204293,3.3669016970884895,0.22272086138238789,0.39834187824423228,0.15411093495063422,0.34689327653616964,0.51424745415651474,null,"DS2",{"$f":"COUNT(S7:S10)","v":4},{"$f":"COUNT(T7:T10)","v":3},{"$f":"COUNT(U7:U10)","v":4},{"$f":"COUNT(V7:V10)","v":4},{"$f":"COUNT(W7:W10)","v":3},{"$f":"COUNT(X7:X10)","v":3},{"$f":"COUNT(Y7:Y10)","v":4},{"$f":"COUNT(Z7:Z10)","v":4},{"$f":"COUNT(AA7:AA10)","v":4}]
[1452,"2006-07-28",7147411.8799999999,512892.07,null,null,null,null,null,null,null,null,null,null,null,null,null,"3Q Box",{"$f":"S19-S18","v":2.1407625151803593},{"$f":"T19-T18","v":0.50616015978036932},0.64851903970151303,3.3669016970884886,0.11136044947000245,0.37318147634844046,0.36445618701616977,0.24953948505983625,0.44227735219456377]
[1452,"2007-07-04",7147411.9100000001,512892.02,{"$f":"C24-C23","v":3.0000000260770321E-2},{"$f":"D24-D23","v":-4.9999999988358468E-2},{"$f":"(E24^2+F24^2)^0.5","v":5.8309519072635693E-2},{"$f":"G24*100/$J$4","v":6.2413414843143773},null,null,null,null,null,null,null,null,null,"Whisker -",{"$f":"S17-S16","v":0},{"$f":"T17-T16","v":0.30563602337483375},0.79862607346098291,0,3.7557616794359205E-8,0.34802107445264729,0.92291509932734384,0.38700241999295137,0.67362678883719185]
[1452,"2008-07-09",7147411.9000000004,512892.04,{"$f":"C25-C24","v":-9.9999997764825821E-3},{"$f":"D25-D24","v":1.9999999960418791E-2},{"$f":"(E25^2+F25^2)^0.5","v":2.236067963963536E-2},{"$f":"G25*100/$J$5","v":2.1999051397484926},null,null,null,null,null,null,null,null,null,"Whisker +",{"$f":"S20-S19","v":0.66707643465524225},{"$f":"T20-T19","v":0.68342294121012648},0.34830497218257284,0,0.33408127329477355,0.423502280140025,0.29187934313073693,0.67906379442195153,0.88953709472304476]
[1452,"2010-07-20",7147411.9299999997,512892.01,2.9999999329447746E-2,-2.9999999969732016E-2,4.2426406375638111E-2,{"$f":"G26*100/$J$6","v":2.0898297337527545},null,null,null,null,null,null,null,null,null,"Offset",1,1,1,1,1,1,1,1,1,null,"DS3",{"$f":"COUNT(S11:S14)","v":4},{"$f":"COUNT(T11:T14)","v":4},{"$f":"COUNT(U11:U14)","v":3},{"$f":"COUNT(V11:V14)","v":3},{"$f":"COUNT(W11:W14)","v":2},{"$f":"COUNT(X11:X14)","v":3},{"$f":"COUNT(Y11:Y14)","v":4},{"$f":"COUNT(Z11:Z14)","v":4},{"$f":"COUNT(AA11:AA14)","v":3}]
[1452,"2010-09-25",7147411.9299999997,512892,0,-1.0000000009313226E-2,1.0000000009313226E-2,{"$f":"G27*100/$J$7","v":5.447761199103474}]
[1452,"2011-08-11",7147411.9199999999,512892.01,-9.9999997764825821E-3,1.0000000009313226E-2,1.4142135472265715E-2,{"$f":"G28*100/$J$8","v":1.6130873273053083},null,null,null,null,null,null,null,null,"DS2","min",{"$f":"MIN(S7:S10)","v":1.0703812326684243},{"$f":"MIN(T7:T10)","v":2.1999051141382258},0.69660991192671873,7.7042980414115432,1.6130874024205419,4.521688712174714,1.0933288541278401,3.7223404153355362,2.7014978639911273]
[1452,"2012-08-06",7147411.9500000002,512892,3.0000000260770321E-2,-1.0000000009313226E-2,3.1622776852017344E-2,{"$f":"G29*100/$J$9","v":3.1973167731264072},null,null,null,null,null,null,null,null,null,"Q1",{"$f":"QUARTILE(S7:S10,1)","v":1.4029060370623374},{"$f":"QUARTILE(T7:T10,1)","v":2.1999051141382258},0.69660991192671873,11.062247742595114,2.6100301904025835,5.2086247281951241,1.4066924052757901,4.4387677013738491,3.0192027948214326]
[null,"2013-09-12",7147411.9720000001,512892.00199999998,2.199999988079071E-2,1.9999999785795808E-3,2.2090721913715486E-2,{"$f":"G30*100/$J$10","v":2.005749626494068},null,null,null,null,null,null,null,null,null,"Average",{"$f":"AVERAGE(S7:S10)","v":2.5456965133472131},{"$f":"AVERAGE(T7:T10)","v":2.6490168931109856},1.9059721018454552,11.062247884407187,4.4284990458386932,6.6519207470345654,2.9734553138288824,5.8685815587617238,4.1623020586785451]
[1452,"2014-09-11",7147411.9280000003,512891.97200000001,{"$f":"C31-C29","v":-2.199999988079071E-2},{"$f":"D31-D29","v":-2.7999999991152436E-2},3.5608987548922645E-2,{"$f":"G31*100/$J$11","v":3.5706814437793311},null,null,null,null,null,null,null,null,null,"Q3",{"$f":"QUARTILE(S7:S10,3)","v":2.9700455032950326},{"$f":"QUARTILE(T7:T10,3)","v":2.8735727825973654},2.3365007188231437,12.181564593280452,5.8362048675477691,7.7170367644644902,3.5837149995836839,6.4277737663320815,4.6788327405362455,null,null,"Standard Error"]
[null,"2015-09-17",7147411.9390000002,512891.98,{"$f":"C32-C31","v":1.0999999940395355E-2},{"$f":"D32-D31","v":7.999999972525984E-3},1.3601470444371577E-2,{"$f":"G32*100/$J$12","v":1.3381500571955864},null,null,null,null,null,null,null,null,null,"Max",{"$f":"MAX(S7:S10)","v":5.4578947667001145},{"$f":"MAX(T7:T10)","v":3.547240451056505},4.6730014376462874,12.181564593280452,8.0654367567109126,9.538512784713447,6.7665882191265032,9.7560660018229459,6.8762434173647904,null,"Point","2007-07-04","2008-07-09","2010-07-20","2010-09-25","2011-08-11","2012-08-06","2013-09-12","2014-09-11","2015-09-17"]
[1453,"2006-07-28",7147439.1100000003,512901.52,null,null,null,null,null,null,null,null,null,null,null,null,null,"Bottom",{"$f":"S29","v":1.4029060370623374},{"$f":"T29","v":2.1999051141382258},0.69660991192671873,11.062247742595114,2.6100301904025835,5.2086247281951241,1.4066924052757901,4.4387677013738491,3.0192027948214326,null,"DS1",{"$f":"AD3/(AD18)^0.5","v":1.3763755891235412},{"$f":"AE3/(AE18)^0.5","v":0.47019851064514295},0.67898139105899447,1.9438816011490458,0.22272086138238922,0.4461492366733385,0.37480085670574131,0.34748160760158592,0.52360540705124092]
[1453,"2007-07-04",7147439.0599999996,512901.52,{"$f":"C34-C33","v":-5.000000074505806E-2},{"$f":"D34-D33","v":0},{"$f":"(E34^2+F34^2)^0.5","v":5.000000074505806E-2},{"$f":"G34*100/$J$4","v":5.3519062381073876},null,null,null,null,null,null,null,null,null,"2Q Box",{"$f":"S30-S29","v":1.1427904762848757},{"$f":"T30-T29","v":0.44911177897275989},1.2093621899187363,1.4181207319552414E-7,1.8184688554361097,1.4432960188394413,1.5667629085530923,1.4298138573878747,1.1430992638571125]
[1453,"2008-07-09",7147439.0899999999,512901.51,{"$f":"C35-C34","v":3.0000000260770321E-2},{"$f":"D35-D34","v":-1.0000000009313226E-2},{"$f":"(E35^2+F35^2)^0.5","v":3.1622776852017344E-2},{"$f":"G35*100/$J$5","v":3.1111357280286609},null,null,null,null,null,null,null,null,null,"3Q Box",{"$f":"S31-S30","v":0.42434898994781944},{"$f":"T31-T30","v":0.22455588948637972},0.43052861697768852,1.1193167088732654,1.4077058217090759,1.0651160174299248,0.6102596857548015,0.5591922075703577,0.51653068185770046]
[1453,"2010-07-20",7147439.0800000001,512901.51,-9.9999997764825821E-3,0,9.9999997764825821E-3,{"$f":"G36*100/$J$6","v":0.49257758683078839},null,null,null,null,null,null,null,null,null,"Whisker -",{"$f":"S29-S28","v":0.33252480439391308},{"$f":"T29-T28","v":0},0,3.3579497011835704,0.99694278798204161,0.6869360160204101,0.31336355114795,0.71642728603831296,0.31770493083030527]
[1453,"2010-09-25",7147439.0800000001,512901.5,0,-1.0000000009313226E-2,1.0000000009313226E-2,{"$f":"G37*100/$J$7","v":5.447761199103474},null,null,null,null,null,null,null,null,null,"Whisker +",{"$f":"S32-S31","v":2.4878492634050819},{"$f":"T32-T31","v":0.67366766845913961},2.3365007188231437,0,2.2292318891631435,1.8214760202489568,3.1828732195428193,3.3282922354908644,2.1974106768285449,null,"DS2",{"$f":"AD7/(AD22)^0.5","v":0.99525306447169115},0.44911177897275983,0.94440817007006728,1.1193166143318876,1.907387555190148,1.4967956088590646,1.2994937254415959,1.3366669097746244,0.94082567388110006]
[1453,"2011-08-11",7147440.9100000001,512901.57,null,null,0,{"$f":"G38*100/$J$8","v":0},null,null,null,null,null,null,null,null,null,"Offset",2,2,2,2,2,2,2,2,2]
[1453,"2012-08-06",7147439.0199999996,512901.5,null,null,0,{"$f":"G39*100/$J$9","v":0}]
[null,"2013-09-12",7147439.0049999999,512901.49300000002,-1.4999999664723873E-2,-6.9999999832361937E-3,1.6552945046336105E-2,{"$f":"G40*100/$J$10","v":1.5029415278389748},null,null,null,null,null,null,null,null,"DS3","min",{"$f":"MIN(S11:S14)","v":1.0703812264379857},{"$f":"MIN(T11:T14)","v":1.3913421650549702},0.69660991192671873,7.7042976826522187,1.6130873273053083,5.8955608461562612,2.8855426401847728,1.1693941791600764,4.5352206877694261]
[1453,"2014-09-11",7147438.9919999996,512901.48800000001,{"$f":"C41-C39","v":-2.7999999932944775E-2},{"$f":"D41-D39","v":-1.1999999987892807E-2},3.0463092357052898E-2,{"$f":"G41*100/$J$11","v":3.0546782171220626},null,null,null,null,null,null,null,null,null,"Q1",{"$f":"QUARTILE(S11:S14,1)","v":2.8062273192897744},{"$f":"QUARTILE(T11:T14,1)","v":1.8235768168900954},0.89902346321692894,9.9429310954227166,1.7801280092887488,6.1450971962045378,3.3171238237875804,3.855718563024686,4.7782987830935149,null,"DS3",{"$f":"AD11/(AD26)^0.5","v":2.2451875486300765},1.1603386706670968,1.5404929369275777,2.2337792653803379,0.33408136396688032,7.5449601482502775,0.23522758092543247,0.94817280912077317,0.29804554440190306]
[null,"2015-09-17",7147438.9749999996,512901.49400000001,{"$f":"C42-C41","v":-1.6999999992549419E-2},{"$f":"D42-D41","v":5.9999999939464033E-3},1.8027756368279361E-2,{"$f":"G42*100/$J$12","v":1.7736202356932527},null,null,null,null,null,null,null,null,null,"Average",{"$f":"AVERAGE(S11:S14)","v":5.4369404678574265},{"$f":"AVERAGE(T11:T14)","v":3.6251015089523095},2.4350773056353674,11.764819297495578,1.9471686912721893,13.68868172272019,3.5227971347551237,4.0031679284602095,5.0412350739747174]
[1454,"2006-07-28",7147423.2400000002,512948.59,null,null,null,null,null,null,null,null,null,null,null,null,null,"Q3",{"$f":"QUARTILE(S11:S14,3)","v":7.2052241509764929},{"$f":"QUARTILE(T11:T14,3)","v":5.2449209428727519},3.3043110024896918,13.795080104917258,2.1142093732556297,17.585242161002157,3.83746963709961,4.9920081760217769,5.2942422670773635]
[1454,"2007-07-04",7147423.2300000004,512948.58,{"$f":"C44-C43","v":-9.9999997764825821E-3},{"$f":"D44-D43","v":-1.0000000009313226E-2},{"$f":"(E44^2+F44^2)^0.5","v":1.4142135472265715E-2},{"$f":"G44*100/$J$4","v":1.5137476385269752},null,null,null,null,null,null,null,null,null,"Max",{"$f":"MAX(S11:S14)","v":11.528358640174034},{"$f":"MAX(T11:T14)","v":6.2222713691331935},5.5071849904722443,15.4085957016413,2.2812500552390702,28.775850775751497,3.9420532465715881,5.1541599135082565,5.5671076557371233]
[1454,"2008-07-09",7147423.2300000004,512948.58,{"$f":"C45-C44","v":0},{"$f":"D45-D44","v":0},{"$f":"(E45^2+F45^2)^0.5","v":0},{"$f":"G45*100/$J$5","v":0},null,null,null,null,null,null,null,null,null,"Bottom",{"$f":"S41","v":2.8062273192897744},{"$f":"T41","v":1.8235768168900954},0.89902346321692894,9.9429310954227166,1.7801280092887488,6.1450971962045378,3.3171238237875804,3.855718563024686,4.7782987830935149]
[1454,"2010-07-20",7147423.2400000002,512948.57,9.9999997764825821E-3,-1.0000000009313226E-2,1.4142135472265715E-2,{"$f":"G46*100/$J$6","v":0.69660991192671873},null,null,null,null,null,null,null,null,null,"2Q Box",{"$f":"S42-S41","v":2.630713148567652},{"$f":"T42-T41","v":1.8015246920622141},1.5360538424184385,1.8218882020728611,0.16704068198344046,7.5435845265156525,0.20567331096754327,0.14744936543552356,0.26293629088120252,null,"DS1",{"$f":"AD33","v":1.3763755891235412},{"$f":"AE33","v":0.47019851064514295},0.67898139105899447,1.9438816011490458,0.22272086138238922,0.4461492366733385,0.37480085670574131,0.34748160760158592,0.52360540705124092]
[1454,"2010-09-25",7147423.2199999997,512948.58,-2.0000000484287739E-2,1.0000000009313226E-2,2.2360680212323021E-2,{"$f":"G47*100/$J$7","v":12.181564593280452},null,null,null,null,null,null,null,null,null,"3Q Box",{"$f":"S43-S42","v":1.7682836831190665},{"$f":"T43-T42","v":1.6198194339204424},0.86923369685432439,2.0302608074216799,0.16704068198344046,3.8965604382819663,0.31467250234448629,0.98884024756156741,0.25300719310264608,null,"DS2",{"$f":"AD37","v":0.99525306447169115},{"$f":"AE37","v":0.44911177897275983},0.94440817007006728,1.1193166143318876,1.907387555190148,1.4967956088590646,1.2994937254415959,1.3366669097746244,0.94082567388110006]
[1454,"2011-08-11",7147423.21,512948.59,null,null,0,{"$f":"G48*100/$J$8","v":0},null,null,null,null,null,null,null,null,null,"Whisker -",{"$f":"S41-S40","v":1.7358460928517887},{"$f":"T41-T40","v":0.43223465183512522},0.20241355129021021,2.2386334127704979,0.16704068198344046,0.24953635004827657,0.43158118360280762,2.6863243838646094,0.24307809532408875,null,"DS3",{"$f":"AD41","v":2.2451875486300765},{"$f":"AE41","v":1.1603386706670968},1.5404929369275777,2.2337792653803379,0.33408136396688032,7.5449601482502775,0.23522758092543247,0.94817280912077317,0.29804554440190306]
[1454,"2012-08-06",7147423.1699999999,512948.56,null,null,0,{"$f":"G49*100/$J$9","v":0},null,null,null,null,null,null,null,null,null,"Whisker +",{"$f":"S44-S43","v":4.3231344891975407},{"$f":"T44-T43","v":0.97735042626044155},2.2028739879825525,1.6135155967240422,0.16704068198344046,11.19060861474934,0.10458360947197809,0.1621517374864796,0.27286538865975984]
[null,"2013-09-12",7147423.1610000003,512948.57400000002,-8.999999612569809E-3,1.4000000024680048E-2,1.664331678834775E-2,{"$f":"G50*100/$J$10","v":1.5111469223251068},null,null,null,null,null,null,null,null,null,"Offset",3,3,3,3,3,3,3,3,3]
[1454,"2014-09-11",7147423.2029999997,512948.57699999999,{"$f":"C51-C49","v":3.2999999821186066E-2},{"$f":"D51-D49","v":1.6999999992549419E-2},3.7121422224168088E-2,{"$f":"G51*100/$J$11","v":3.7223404153355362}]
[null,"2015-09-17",7147423.1799999997,512948.56199999998,{"$f":"C52-C51","v":-2.3000000044703484E-2},{"$f":"D52-D51","v":-1.5000000013969839E-2},2.7459060480567347E-2,{"$f":"G52*100/$J$12","v":2.7014978639911273}]
[1455,"2006-07-28",7147397.0300000003,512939.87]
[1455,"2007-07-04",7147397.0300000003,512939.88,{"$f":"C54-C53","v":0},{"$f":"D54-D53","v":1.0000000009313226E-2},{"$f":"(E54^2+F54^2)^0.5","v":1.0000000009313226E-2},{"$f":"G54*100/$J$4","v":1.0703812326684243}]
[1455,"2008-07-09",7147397.0499999998,512939.89,{"$f":"C55-C54","v":1.9999999552965164E-2},{"$f":"D55-D54","v":1.0000000009313226E-2},{"$f":"(E55^2+F55^2)^0.5","v":2.2360679379322786E-2},{"$f":"G55*100/$J$5","v":2.1999051141382258}]
[1455,"2010-07-20",7147397.0800000001,512939.9,3.0000000260770321E-2,1.0000000009313226E-2,3.1622776852017344E-2,{"$f":"G56*100/$J$6","v":1.5576671458820959}]
[1455,"2010-09-25",7147397.0599999996,512939.89,-2.0000000484287739E-2,-1.0000000009313226E-2,2.2360680212323021E-2,{"$f":"G57*100/$J$7","v":12.181564593280452}]
[1455,"2011-08-11",7147397.0700000003,512939.92,1.0000000707805157E-2,2.9999999969732016E-2,3.1622776796796717E-2,{"$f":"G58*100/$J$8","v":3.6069729783846256}]
[1455,"2012-08-06",7147397.1100000003,512939.94,4.0000000037252903E-2,2.0000000018626451E-2,4.4721359591645804E-2,{"$f":"G59*100/$J$9","v":4.521688712174714}]
[null,"2013-09-12",7147397.1109999996,512939.92800000001,9.9999923259019852E-4,-1.1999999987892807E-2,1.2041594502997032E-2,{"$f":"G60*100/$J$10","v":1.0933288541278401}]
[1455,"2014-09-11",7147397.0700000003,512939.91600000003,{"$f":"C61-C59","v":-4.0000000037252903E-2},{"$f":"D61-D59","v":-2.3999999975785613E-2},4.6647615178248301E-2,{"$f":"G61*100/$J$11","v":4.6775767967199533}]
[null,"2015-09-17",7147397.085,512939.94400000002,1.4999999664723873E-2,2.7999999991152436E-2,3.176476018241367E-2,{"$f":"G62*100/$J$12","v":3.1251044384315341}]
[1456,"2006-07-28",7147392.7000000002,512951.21]
[1456,"2007-07-04",7147392.75,512951.22,{"$f":"C64-C63","v":4.9999999813735485E-2},{"$f":"D64-D63","v":9.9999999511055648E-3},{"$f":"(E64^2+F64^2)^0.5","v":5.0990194943691482E-2},{"$f":"G64*100/$J$4","v":5.4578947667001145}]
[1456,"2008-07-09",7147392.7699999996,512951.25,{"$f":"C65-C64","v":1.9999999552965164E-2},{"$f":"D65-D64","v":3.0000000027939677E-2},{"$f":"(E65^2+F65^2)^0.5","v":3.6055512529916803E-2},{"$f":"G65*100/$J$5","v":3.547240451056505}]
[1456,"2010-07-20",7147392.8600000003,512951.28,9.0000000782310963E-2,3.0000000027939677E-2,9.4868330556052025E-2,{"$f":"G66*100/$J$6","v":4.6730014376462874}]
[1456,"2010-09-25",7147392.8499999996,512951.27,-1.0000000707805157E-2,-1.0000000009313226E-2,1.414213613081023E-2,{"$f":"G67*100/$J$7","v":7.7042980414115432}]
[1456,"2011-08-11",7147392.9199999999,512951.26,7.0000000298023224E-2,-1.0000000009313226E-2,7.0710678414999784E-2,{"$f":"G68*100/$J$8","v":8.0654367567109126}]
[1456,"2012-08-06",7147393,512951.31,8.0000000074505806E-2,4.9999999988358468E-2,9.433981137757684E-2,{"$f":"G69*100/$J$9","v":9.538512784713447}]
[null,"2013-09-12",7147393.0729999999,512951.32500000001,7.2999999858438969E-2,1.5000000013969839E-2,7.452516339969463E-2,{"$f":"G70*100/$J$10","v":6.7665882191265032}]
[1456,"2014-09-11",7147393.0949999997,512951.33100000001,{"$f":"C71-C69","v":9.4999999739229679E-2},{"$f":"D71-D69","v":2.1000000007916242E-2},9.7293370538727456E-2,{"$f":"G71*100/$J$11","v":9.7560660018229459}]
[null,"2015-09-17",7147393.1610000003,512951.35399999999,6.6000000573694706E-2,2.2999999986495823E-2,6.9892775557324302E-2,{"$f":"G72*100/$J$12","v":6.8762434173647904}]
[1457,"2006-07-28",7147420.5,512958]
[1457,"2007-07-04",7147420.5199999996,512958,{"$f":"C74-C73","v":1.9999999552965164E-2},{"$f":"D74-D73","v":0},{"$f":"(E74^2+F74^2)^0.5","v":1.9999999552965164E-2},{"$f":"G74*100/$J$4","v":2.1407624154933385}]
[1457,"2008-07-09",7147420.5,512958.01,{"$f":"C75-C74","v":-1.9999999552965164E-2},{"$f":"D75-D74","v":1.0000000009313226E-2},{"$f":"(E75^2+F75^2)^0.5","v":2.2360679379322786E-2},{"$f":"G75*100/$J$5","v":2.1999051141382258}]
[1457,"2010-07-20",7147420.4900000002,512958.02,-9.9999997764825821E-3,1.0000000009313226E-2,1.4142135472265715E-2,{"$f":"G76*100/$J$6","v":0.69660991192671873}]
[1457,"2010-09-25",7147420.4800000004,512958,-9.9999997764825821E-3,-2.0000000018626451E-2,2.2360679691697874E-2,{"$f":"G77*100/$J$7","v":12.181564309656304}]
[1457,"2011-08-11",7147420.4699999997,512958.01,-1.0000000707805157E-2,1.0000000009313226E-2,1.414213613081023E-2,{"$f":"G78*100/$J$8","v":1.6130874024205419}]
[1457,"2012-08-06",7147420.4400000004,512957.96,-2.9999999329447746E-2,-4.9999999988358468E-2,5.8309518593474184E-2,{"$f":"G79*100/$J$9","v":5.8955607442155342}]
[null,"2013-09-12",7147420.426,512957.984,-1.4000000432133675E-2,2.3999999975785613E-2,2.7784888175723371E-2,{"$f":"G80*100/$J$10","v":2.5227572597360775}]
[1457,"2014-09-11",7147420.4780000001,512957.99699999997,{"$f":"C81-C79","v":3.7999999709427357E-2},{"$f":"D81-D79","v":3.699999995296821E-2},5.3037722183707385E-2,{"$f":"G81*100/$J$11","v":5.3183430211684604}]
[null,"2015-09-17",7147420.4380000001,512957.99400000001,-4.0000000037252903E-2,-2.9999999678693712E-3,4.0112342275008678E-2,{"$f":"G82*100/$J$12","v":3.9463625149267303}]
[1458,"2006-07-28",7147412.1699999999,512986.91]
[1458,"2007-07-04",7147412.1699999999,512986.9,{"$f":"C84-C83","v":0},{"$f":"D84-D83","v":-9.9999999511055648E-3},{"$f":"(E84^2+F84^2)^0.5","v":9.9999999511055648E-3},{"$f":"G84*100/$J$4","v":1.0703812264379857}]
[1458,"2008-07-09",7147412.1600000001,512986.91,{"$f":"C85-C84","v":-9.9999997764825821E-3},{"$f":"D85-D84","v":9.9999999511055648E-3},{"$f":"(E85^2+F85^2)^0.5","v":1.4142135431106682E-2},{"$f":"G85*100/$J$5","v":1.3913421650549702}]
[1458,"2010-07-20",7147412.1500000004,512986.92,-9.9999997764825821E-3,1.0000000009313226E-2,1.4142135472265715E-2,{"$f":"G86*100/$J$6","v":0.69660991192671873}]
[1458,"2010-09-25",7147412.1299999999,512986.9,-2.0000000484287739E-2,{"$f":"D87-D86","v":-1.9999999960418791E-2},2.8284271561916909E-2,{"$f":"G87*100/$J$7","v":15.4085957016413}]
[1458,"2011-08-11",7147412.1500000004,512986.9,2.0000000484287739E-2,0,2.0000000484287739E-2,{"$f":"G88*100/$J$8","v":2.2812500552390702}]
[1458,"2012-08-06",7147412.0999999996,512986.87,-5.000000074505806E-2,-3.0000000027939677E-2,5.8309519601709867E-2,{"$f":"G89*100/$J$9","v":5.8955608461562612}]
[null,"2013-09-12",7147412.0930000003,512986.90100000001,-6.9999992847442627E-3,3.1000000017229468E-2,3.1780497023404894E-2,{"$f":"G90*100/$J$10","v":2.8855426401847728}]
[1458,"2014-09-11",7147412.1430000002,512986.89399999997,{"$f":"C91-C89","v":4.3000000528991222E-2},{"$f":"D91-D89","v":2.3999999975785613E-2},4.924428945909317E-2,{"$f":"G91*100/$J$11","v":4.9379575968596168}]
[null,"2015-09-17",7147412.0920000002,512986.89600000001,-5.0999999977648258E-2,2.0000000367872417E-3,5.1039200599806336E-2,{"$f":"G92*100/$J$12","v":5.0213768784176045}]
[1459,"2006-07-28",7147385.79,512979.99]
[1459,"2007-07-04",7147385.8399999999,512980.01,{"$f":"C94-C93","v":4.9999999813735485E-2},{"$f":"D94-D93","v":2.0000000018626451E-2},{"$f":"(E94^2+F94^2)^0.5","v":5.3851647905320467E-2},{"$f":"G94*100/$J$4","v":5.7641793212439794}]
[1459,"2008-07-09",7147385.8799999999,512980.04,{"$f":"C95-C94","v":4.0000000037252903E-2},{"$f":"D95-D94","v":2.9999999969732016E-2},{"$f":"(E95^2+F95^2)^0.5","v":5.0000000011641538E-2},{"$f":"G95*100/$J$5","v":4.9191374674526047}]
[1459,"2010-07-20",7147385.9800000004,512980.09,0.10000000055879354,5.0000000046566129E-2,0.11180339939561462,{"$f":"G96*100/$J$6","v":5.5071849904722443}]
[1459,"2010-09-25",7147385.9699999997,512980.11,-1.0000000707805157E-2,{"$f":"D97-D96","v":1.9999999960418791E-2},2.2360680056135486E-2,{"$f":"G97*100/$J$7","v":12.181564508193214}]
[1459,"2011-08-11",7147385.9199999999,512980.04,null,null,0,{"$f":"G98*100/$J$8","v":0}]
[1459,"2012-08-06",7147386.46,512980.31,null,null,0,{"$f":"G99*100/$J$9","v":0}]
[null,"2013-09-12",7147386.4979999997,512980.33100000001,3.7999999709427357E-2,2.1000000007916242E-2,4.3416586441692551E-2,{"$f":"G100*100/$J$10","v":3.9420532465715881}]
[1459,"2014-09-11",7147386.5010000002,512980.34100000001,{"$f":"C101-C99","v":4.1000000201165676E-2},{"$f":"D101-D99","v":3.1000000017229468E-2},5.1400389274438504E-2,{"$f":"G101*100/$J$11","v":5.1541599135082565}]
[null,"2015-09-17",7147386.5420000004,512980.38,4.1000000201165676E-2,3.8999999989755452E-2,5.6586217541875962E-2,{"$f":"G102*100/$J$12","v":5.5671076557371233}]
[1460,"2006-07-28",7147382.4800000004,512988.03]
[1460,"2007-07-04",7147382.5800000001,512988.07,{"$f":"C104-C103","v":9.999999962747097E-2},{"$f":"D104-D103","v":3.9999999979045242E-2},{"$f":"(E104^2+F104^2)^0.5","v":0.10770329578902316},{"$f":"G104*100/$J$4","v":11.528358640174034}]
[1460,"2008-07-09",7147382.6399999997,512988.09,{"$f":"C105-C104","v":5.9999999590218067E-2},{"$f":"D105-D104","v":2.0000000018626451E-2},{"$f":"(E105^2+F105^2)^0.5","v":6.3245552820504508E-2},{"$f":"G105*100/$J$5","v":6.2222713691331935}]
[1460,"2010-07-20","n.a","n.a",null,null,null,{"$f":"G106*100/$J$6","v":0}]
[1460,"2010-09-25","n.a","n.a",null,null,null,{"$f":"G107*100/$J$7","v":0}]
[1460,"2011-08-11",7147381.8200000003,512988.4,null,null,null,{"$f":"G108*100/$J$8","v":0}]
[1460,"2012-08-06",7147381.5499999998,512988.49,{"$f":"C109-C108","v":-0.27000000048428774},8.999999996740371E-2,0.28460498986428195,{"$f":"G109*100/$J$9","v":28.775850775751497}]
[null,"2013-09-12",7147381.585,512988.51299999998,3.5000000149011612E-2,2.2999999986495823E-2,{"$f":"(E110^2+F110^2)^0.5","v":4.1880783299857477E-2},{"$f":"G110*100/$J$10","v":3.8026084339422841}]
[1460,"2014-09-11",7147381.5750000002,512988.51899999997,-9.9999997764825821E-3,5.9999999939464033E-3,1.1661903594911446E-2,{"$f":"G111*100/$J$11","v":1.1693941791600764}]
[null,"2015-09-17",7147383.2139999997,512988.94,null,null,0,{"$f":"G112*100/$J$12","v":0}]
[1461,"2006-07-28",7147410.21,512995.9]
[1461,"2007-07-04",7147410.1799999997,512995.89,{"$f":"C114-C113","v":-3.0000000260770321E-2},{"$f":"D114-D113","v":-1.0000000009313226E-2},{"$f":"(E114^2+F114^2)^0.5","v":3.1622776852017344E-2},{"$f":"G114*100/$J$4","v":3.3848426835737038}]
[1461,"2008-07-09",7147410.2000000002,512995.89,{"$f":"C115-C114","v":2.0000000484287739E-2},{"$f":"D115-D114","v":0},{"$f":"(E115^2+F115^2)^0.5","v":2.0000000484287739E-2},{"$f":"G115*100/$J$5","v":1.9676550341684704}]
[1461,"2010-07-20",7147410.1799999997,512995.88,-2.0000000484287739E-2,-1.0000000009313226E-2,2.2360680212323021E-2,{"$f":"G116*100/$J$6","v":1.1014370145071393}]
[1461,"2010-09-25",7147410.1699999999,512995.89,-9.9999997764825821E-3,1.0000000009313226E-2,1.4142135472265715E-2,{"$f":"G117*100/$J$7","v":7.7042976826522187}]
[1461,"2011-08-11",7147410.1600000001,512995.88,-9.9999997764825821E-3,-1.0000000009313226E-2,1.4142135472265715E-2,{"$f":"G118*100/$J$8","v":1.6130873273053083}]
[1461,"2012-08-06",7147410.0999999996,512995.86,-6.0000000521540642E-2,-2.0000000018626451E-2,6.3245553704034688E-2,{"$f":"G119*100/$J$9","v":6.3946335462528143}]
[null,"2013-09-12",7147410.1030000001,512995.89799999999,3.0000004917383194E-3,3.8000000000465661E-2,3.8118237144257085E-2,{"$f":"G120*100/$J$10","v":3.4609842183218498}]
[1461,"2014-09-11",7147410.1330000004,512995.89399999997,{"$f":"C121-C119","v":3.300000075250864E-2},{"$f":"D121-D119","v":3.3999999985098839E-2},4.7381431475339492E-2,{"$f":"G121*100/$J$11","v":4.7511600243128891}]
[null,"2015-09-17",7147410.091,512995.875,-4.2000000365078449E-2,-1.8999999971129E-2,4.6097722607190604E-2,{"$f":"G122*100/$J$12","v":4.5352206877694261}]

{"sheet":"Clinton Stats","index":7,"n_rows":121,"n_cols":31,"rows_kept":121,"cut":false,"hidden":false,"merged":[[22,15,22,24],[35,15,35,26]]}
["Monitor","Date","Northing\n(m)","Easting\n(m)","duration","dn","de","Movement","Movement Rate (cm/y)","N/S","E/W","Quadrant","Azimuth","Variation",null,"Point","2004-07-28","2006-07-28","2008-07-09","2010-07-20","2010-09-25","2011-08-11","2012-08-06","2014-09-11","2015-09-17","Average","Stddev","Point",null,"Date"]
["81-1","2001-06-19",7147034.71,512978.88,null,null,null,null,null,null,null,null,null,null,null,"81-1",{"$f":"INDIRECT(\"I\"&TEXT(3+VLOOKUP($P2,$AB$2:$AC$11,2,FALSE)*12+VLOOKUP(Q$1,$AD$2:$AE$11,2,FALSE)*1,0))","v":6.7344170072078962},2.1592822682099939,1.6211114537902149,0.49257758683078845,7.7042976826522187,6.6509295192225091,5.0554016608728087,1.4014323818809891,0.9739394819289694,{"$f":"AVERAGE(Q2:Y2)","v":3.6437098936218209},{"$f":"_xlfn.STDEV.S(Q2:Y2)","v":2.860433409169032},"81-1",0,"2003-08-20",0]
["81-1","2003-08-20",7147034.8200000003,512978.93,{"$f":"(B3-B2)/365","v":2.1698630136986301},{"$f":"C3-C2","v":0.11000000033527613},{"$f":"D3-D2","v":4.9999999988358468E-2},{"$f":"(F3^2+G3^2)^0.5","v":0.12083046003635256},{"$f":"H3/E3*100","v":5.5685754940995817},{"$f":"IF(F3>0,2,0)","v":2},{"$f":"IF(G3>0,1,0)","v":1},{"$f":"SUM(J3:K3)","v":3},{"$f":"IF(L3=3,(ATAN(G3/F3)*180/PI()),IF(L3=1,(90+ATAN(ABS(F3)/ABS(G3))*180/PI()),IF(L3=0,(180+ATAN(ABS(G3)/ABS(F3))*180/PI()),IF(L3=2,(270+ATAN(ABS(F3)/ABS(G3))*180/PI()),\"ERROR\"))))","v":24.443954709603762},{"$f":"IF(AND(ABS($M$13-M3)>0,ABS($M$13-M3)<180),ABS($M$13-M3),ABS(360-MAX($M$13,M3)+MIN($M$13,M3)))","v":29.362838612819115},null,223,{"$f":"INDIRECT(\"I\"&TEXT(3+VLOOKUP($P3,$AB$2:$AC$11,2,FALSE)*12+VLOOKUP(Q$1,$AD$2:$AE$11,2,FALSE)*1,0))","v":3.0472331055741857},{"$f":"INDIRECT(\"I\"&TEXT(3+VLOOKUP($P3,$AB$2:$AC$11,2,FALSE)*12+VLOOKUP(R$1,$AD$2:$AE$11,2,FALSE)*1,0))","v":2.2022715425972583},2.2925977880548762,1.4777328063672288,19.642182480567747,5.8160691107648095,4.289650572708215,1.6298852274057265,3.0877140819000757,{"$f":"AVERAGE(Q3:Y3)","v":4.8317040795489028},{"$f":"_xlfn.STDEV.S(Q3:Y3)","v":5.7194913262021592},223,1,"2004-07-28",1]
["81-1","2004-07-28",7147034.7570000002,512978.924,{"$f":"(B4-B3)/365","v":0.9397260273972603},{"$f":"C4-C3","v":-6.3000000081956387E-2},{"$f":"D4-D3","v":-5.9999999939464033E-3},{"$f":"(F4^2+G4^2)^0.5","v":6.3285069410200234E-2},{"$f":"H4/E4*100","v":6.7344170072078962},{"$f":"IF(F4>0,2,0)","v":0},{"$f":"IF(G4>0,1,0)","v":0},{"$f":"SUM(J4:K4)","v":0},{"$f":"IF(L4=3,(ATAN(G4/F4)*180/PI()),IF(L4=1,(90+ATAN(ABS(F4)/ABS(G4))*180/PI()),IF(L4=0,(180+ATAN(ABS(G4)/ABS(F4))*180/PI()),IF(L4=2,(270+ATAN(ABS(F4)/ABS(G4))*180/PI()),\"ERROR\"))))","v":185.44033201851468},{"$f":"IF(AND(ABS($M$13-M4)>0,ABS($M$13-M4)<180),ABS($M$13-M4),ABS(360-MAX($M$13,M4)+MIN($M$13,M4)))","v":131.63353869609182},null,225,3.8837463356867761,2.2090721916350424,2.2925977880548762,1.1014370145071393,27.778240603652403,2.5505150867180948,5.0554016196759743,0.53274468547930753,2.6763001169173539,5.3422283824807737,8.5199565714944256,225,2,"2006-07-28",2]
["81-1","2006-07-28",7147034.7999999998,512978.92,2,4.2999999597668648E-2,-4.0000000153668225E-3,4.318564536419988E-2,2.1592822682099939,2,0,2,{"$f":"IF(L5=3,(ATAN(G5/F5)*180/PI()),IF(L5=1,(90+ATAN(ABS(F5)/ABS(G5))*180/PI()),IF(L5=0,(180+ATAN(ABS(G5)/ABS(F5))*180/PI()),IF(L5=2,(270+ATAN(ABS(F5)/ABS(G5))*180/PI()),\"ERROR\"))))","v":354.6854542603142},59.121339062108675,null,1195,1.1311962332829977,1.1543396388088192,4.2273414459326535,0.9851551736615769,10.895522144525799,2.5505149917040058,1.429883503428528,1.8207089488620067,3.2881039395282095,3.0536406688593996,3.140845114729184,1195,3,"2008-07-09",3]
["81-1","2008-07-09",7147034.8300000001,512978.93,1.9506849315068493,3.0000000260770321E-2,1.0000000009313226E-2,3.1622776852017344E-2,1.6211114537902149,2,1,3,18.434948689519882,35.371844632902992,null,1834,5.4852259401741623,2.8969812093911798,2.760653298517131,3.1540355477413429,33.137437643787955,6.1424535867348373,6.1501615571573209,1.7636986117614408,1.3125896162163189,6.9781374457201881,9.9767056927943703,1834,4,"2010-07-20",4]
["81-1","2010-07-20",7147034.8399999999,512978.93,2.0301369863013701,9.9999997764825821E-3,0,9.9999997764825821E-3,0.49257758683078845,2,0,2,0,53.806793322422877,null,"BH-4",null,null,null,null,null,null,null,{"$f":"INDIRECT(\"I\"&TEXT(3+VLOOKUP($P7,$AB$2:$AC$11,2,FALSE)*12+VLOOKUP(X$1,$AD$2:$AE$11,2,FALSE)*1,0))","v":1.467902446337676},1.9404111578583387,1.7041568020980074,{"$f":"_xlfn.STDEV.S(X7:Y7)","v":0.33411411408597957},"BH-4",5,"2010-09-25",5]
["81-1","2010-09-25",7147034.8300000001,512978.94,0.18356164383561643,-9.9999997764825821E-3,1.0000000009313226E-2,1.4142135472265715E-2,7.7042976826522187,0,1,1,134.99999933298932,81.193206010566442,null,2836,null,null,null,null,null,null,null,6.6110155831323274,11.743867636023221,9.1774416095777749,{"$f":"_xlfn.STDEV.S(X8:Y8)","v":3.6294744934264407},2836,6,"2011-08-11",6]
["81-1","2011-08-11",7147034.8600000003,512978.99,0.87671232876712324,3.0000000260770321E-2,4.9999999988358468E-2,5.8309519072635693E-2,6.6509295192225091,2,1,3,59.036243242319934,5.229449919897057,null,186,null,null,null,null,null,null,null,8.9247053574244166,5.419094729228938,7.1719000433266773,{"$f":"_xlfn.STDEV.S(X9:Y9)","v":2.4788410473966551},186,7,"2012-08-06",7]
["81-1","2012-08-06",7147034.8600000003,512978.94,0.989041095890411,0,-4.9999999988358468E-2,4.9999999988358468E-2,5.0554016608728087,0,0,0,270,143.80679332242289,null,300,null,null,null,null,null,null,null,1.0308299412685646,4.0956065949317892,2.5632182681001767,{"$f":"_xlfn.STDEV.S(X10:Y10)","v":2.1671243546274814},300,8,"2014-09-11",8]
["81-1","2014-09-11",7147034.8430000003,512978.96399999998,2.0986301369863014,-1.6999999992549419E-2,2.3999999975785613E-2,2.9410882315639385E-2,1.4014323818809891,0,1,1,125.31121345505541,71.504420132632532,null,null,null,null,null,null,null,null,null,null,null,null,null,"BH-4 Cable",9,"2015-09-17",9]
["81-1","2015-09-17",7147034.8499999996,512978.97100000002,1.0164383561643835,6.9999992847442627E-3,7.0000000414438546E-3,9.8994944601547286E-3,0.9739394819289694,2,1,3,45.000003096835364,8.8067902255875126]
[null,null,null,"Totals",{"$f":"SUM(E3:E12)","v":14.254794520547946},{"$f":"C12-C3","v":2.9999999329447746E-2},{"$f":"D12-D3","v":4.1000000026542693E-2},5.0803542808975102E-2,{"$f":"H13*100/E13","v":0.35639617769125331},{"$f":"IF(G13>0,2,0)","v":2},{"$f":"IF(H13>0,1,0)","v":1},3,53.806793322422877,{"$f":"AVERAGE(N3:N12)","v":61.983701393745186},null,"min",{"$f":"MIN(Q2:Q11)","v":1.1311962332829977},{"$f":"MIN(R2:R11)","v":1.1543396388088192},1.6211114537902149,0.49257758683078845,7.7042976826522187,2.5505149917040058,1.429883503428528,0.53274468547930753,0.9739394819289694]
[223,"2001-06-19","N/A","N/A",null,null,null,null,null,null,null,null,null,null,null,"Q1",{"$f":"QUARTILE(Q2:Q11,1)","v":3.0472331055741857},{"$f":"QUARTILE(R2:R11,1)","v":2.1592822682099939},2.2925977880548762,0.9851551736615769,10.895522144525799,2.5505150867180948,4.289650572708215,1.4014323818809891,1.9404111578583387]
[223,"2003-08-20",7146978.0499999998,512942.74,{"$f":"(B15-B14)/365","v":2.1698630136986301},null,null,null,null,null,null,null,null,null,null,"Median",{"$f":"MEDIAN(Q2:Q11)","v":3.8837463356867761},{"$f":"MEDIAN(R2:R11)","v":2.2022715425972583},2.2925977880548762,1.1014370145071393,19.642182480567747,5.8160691107648095,5.0554016196759743,1.6298852274057265,3.0877140819000757]
[223,"2004-07-28",7146978.0760000004,512942.728,{"$f":"(B16-B15)/365","v":0.9397260273972603},{"$f":"C16-C15","v":2.6000000536441803E-2},{"$f":"D16-D15","v":-1.1999999987892807E-2},{"$f":"(F16^2+G16^2)^0.5","v":2.8635642608546459E-2},{"$f":"H16/E16*100","v":3.0472331055741857},{"$f":"IF(F16>0,2,0)","v":2},{"$f":"IF(G16>0,1,0)","v":0},{"$f":"SUM(J16:K16)","v":2},{"$f":"IF(L16=3,(ATAN(G16/F16)*180/PI()),IF(L16=1,(90+ATAN(ABS(F16)/ABS(G16))*180/PI()),IF(L16=0,(180+ATAN(ABS(G16)/ABS(F16))*180/PI()),IF(L16=2,(270+ATAN(ABS(F16)/ABS(G16))*180/PI()),\"ERROR\"))))","v":335.2248599029561},{"$f":"IF(AND(ABS($M$25-M16)>0,ABS($M$25-M16)<180),ABS($M$25-M16),ABS(360-MAX($M$25,M16)+MIN($M$25,M16)))","v":31.900156432704794},null,"Q3",{"$f":"QUARTILE(Q2:Q11,3)","v":5.4852259401741623},{"$f":"QUARTILE(R2:R11,3)","v":2.2090721916350424},2.760653298517131,1.4777328063672288,27.778240603652403,6.1424535867348373,5.0554016608728087,1.8207089488620067,4.0956065949317892]
[223,"2006-07-28",7146978.1200000001,512942.73,2,4.3999999761581421E-2,1.9999999785795808E-3,4.4045430851945171E-2,2.2022715425972583,2,1,3,2.602562188747009,{"$f":"IF(AND(ABS($M$25-M17)>0,ABS($M$25-M17)<180),ABS($M$25-M17),ABS(360-MAX($M$25,M17)+MIN($M$25,M17)))","v":4.5224541469138826},null,"Max",{"$f":"MAX(Q2:Q11)","v":6.7344170072078962},{"$f":"MAX(R2:R11)","v":2.8969812093911798},4.2273414459326535,3.1540355477413429,33.137437643787955,6.6509295192225091,6.1501615571573209,8.9247053574244166,11.743867636023221]
[223,"2008-07-09",7146978.1600000001,512942.75,1.9506849315068493,4.0000000037252903E-2,2.0000000018626451E-2,4.4721359591645804E-2,2.2925977880548762,2,1,3,26.56505117707799,19.440034841417098,null,"Bottom",{"$f":"Q14","v":3.0472331055741857},{"$f":"R14","v":2.1592822682099939},2.2925977880548762,0.9851551736615769,10.895522144525799,2.5505150867180948,4.289650572708215,1.4014323818809891,1.9404111578583387]
[223,"2010-07-20",7146978.1900000004,512942.75,2.0301369863013701,3.0000000260770321E-2,0,3.0000000260770321E-2,1.4777328063672288,2,0,2,0,7.1250163356608915,null,"2Q Box",{"$f":"Q15-Q14","v":0.83651323011259038},{"$f":"R15-R14","v":4.2989274387264409E-2},0,0.11628184084556237,8.7466603360419484,3.2655540240467147,0.76575104696775931,0.22845284552473744,1.1473029240417369]
[223,"2010-09-25",7146978.1699999999,512942.78,0.18356164383561643,-2.0000000484287739E-2,3.0000000027939677E-2,3.6055513046521617E-2,19.642182480567747,0,1,1,123.69006814168193,116.56505180602105,null,"3Q Box",{"$f":"Q16-Q15","v":1.6014796044873862},{"$f":"R16-R15","v":6.8006490377841011E-3},0.4680555104622548,0.37629579186008955,8.1360581230846556,0.32638447597002784,4.1196834388301795E-8,0.19082372145628024,1.0078925130317136]
[223,"2011-08-11",7146978.2199999997,512942.79,0.87671232876712324,4.9999999813735485E-2,9.9999999511055648E-3,5.0990194943691482E-2,5.8160691107648095,2,1,3,11.309932461193087,4.1849161255321956,null,"Whisker -",{"$f":"Q14-Q13","v":1.916036872291188},{"$f":"R14-R13","v":1.0049426294011747},0.67148633426466131,0.49257758683078845,3.1912244618735803,9.5014089041001171E-8,2.859767069279687,0.86868769640168153,0.96647167592936933]
[223,"2012-08-06",7146978.25,512942.76,0.989041095890411,3.0000000260770321E-2,-2.9999999969732016E-2,4.2426407034182621E-2,4.289650572708215,2,0,2,315.00000027792112,52.125016057739771,null,"Whisker +",{"$f":"Q17-Q16","v":1.2491910670337338},{"$f":"R17-R16","v":0.68790901775613733},1.4666881474155224,1.6763027413741141,5.3591970401355518,0.50847593248767176,1.0947598962845122,7.1039964085624101,7.6482610410914322]
[223,"2014-09-11",7146978.2709999997,512942.78700000001,2.0986301369863014,2.0999999716877937E-2,2.7000000001862645E-2,3.4205262580624292E-2,1.6298852274057265,2,1,3,52.125016725164222,45.000000389503327,null,"Azimuth"]
[223,"2015-09-17",7146978.2980000004,512942.77100000001,1.0164383561643835,2.7000000700354576E-2,-1.6000000003259629E-2,3.1384710257121314E-2,3.0877140819000757,2,0,2,329.34933268964272,37.775683646018166,null,"Point","2004-07-28","2006-07-28","2008-07-09","2010-07-20","2010-09-25","2011-08-11","2012-08-06","2014-09-11","2015-09-17",null,"Stddev."]
[null,"Totals From August 2, 2003 to September 17, 2015",null,null,{"$f":"SUM(E15:E24)","v":14.254794520547946},{"$f":"C24-C15","v":0.24800000060349703},{"$f":"D24-D15","v":3.1000000017229468E-2},0.24992999079822883,{"$f":"H25*100/E25","v":1.7533047595878055},{"$f":"IF(G25>0,2,0)","v":2},{"$f":"IF(H25>0,1,0)","v":1},3,7.1250163356608915,{"$f":"AVERAGE(N15:N24)","v":35.404258864612352},null,"81-1",{"$f":"INDIRECT(\"M\"&TEXT(3+VLOOKUP($P25,$AB$2:$AC$11,2,FALSE)*12+VLOOKUP(Q$24,$AD$2:$AE$11,2,FALSE)*1,0))","v":185.44033201851468},354.6854542603142,18.434948689519882,0,134.99999933298932,59.036243242319934,270,125.31121345505541,45.000003096835364,null,{"$f":"_xlfn.STDEV.S(Q25:Y25)","v":119.76720853368637}]
[225,"2001-06-19","N/A","N/A",null,null,null,null,null,null,null,null,null,null,null,223,{"$f":"INDIRECT(\"M\"&TEXT(3+VLOOKUP($P26,$AB$2:$AC$11,2,FALSE)*12+VLOOKUP(Q$24,$AD$2:$AE$11,2,FALSE)*1,0))","v":335.2248599029561},{"$f":"INDIRECT(\"M\"&TEXT(3+VLOOKUP($P26,$AB$2:$AC$11,2,FALSE)*12+VLOOKUP(R$24,$AD$2:$AE$11,2,FALSE)*1,0))","v":2.602562188747009},26.56505117707799,0,123.69006814168193,11.309932461193087,315.00000027792112,52.125016725164222,329.34933268964272,null,{"$f":"_xlfn.STDEV.S(Q26:Y26)","v":150.01192129388119}]
[225,"2003-08-20",7146918.7199999997,512905.22,null,null,null,null,null,null,null,null,null,null,null,225,279.46232229816218,354.8055710444263,26.56505117707799,333.43494935653052,78.690067769695219,26.565050643469473,306.8698970455344,333.43495042374752,53.972626903333442,null,147.26895384483609]
[225,"2004-07-28",7146918.7259999998,512905.18400000001,{"$f":"(B28-B27)/365","v":0.9397260273972603},{"$f":"C28-C27","v":6.0000000521540642E-3},{"$f":"D28-D27","v":-3.599999996367842E-2},{"$f":"(F28^2+G28^2)^0.5","v":3.6496575154536005E-2},{"$f":"H28/E28*100","v":3.8837463356867761},{"$f":"IF(F28>0,2,0)","v":2},{"$f":"IF(G28>0,1,0)","v":0},{"$f":"SUM(J28:K28)","v":2},{"$f":"IF(L28=3,(ATAN(G28/F28)*180/PI()),IF(L28=1,(90+ATAN(ABS(F28)/ABS(G28))*180/PI()),IF(L28=0,(180+ATAN(ABS(G28)/ABS(F28))*180/PI()),IF(L28=2,(270+ATAN(ABS(F28)/ABS(G28))*180/PI()),\"ERROR\"))))","v":279.46232229816218},{"$f":"IF(AND(ABS($M$37-M28)>0,ABS($M$37-M28)<180),ABS($M$37-M28),ABS(360-MAX($M$37,M28)+MIN($M$37,M28)))","v":82.583086198008147},null,1195,318.81407270930055,274.96974154153793,14.036243467926477,0,180,26.565051710686529,314.99999933298932,47.121095798179297,321.07245597129207,null,144.0021140386566]
[225,"2006-07-28",7146918.7699999996,512905.18,2,4.3999999761581421E-2,-4.0000000153668225E-3,4.4181443832700847E-2,2.2090721916350424,2,0,2,354.8055710444263,{"$f":"IF(AND(ABS($M$37-M29)>0,ABS($M$37-M29)<180),ABS($M$37-M29),ABS(360-MAX($M$37,M29)+MIN($M$37,M29)))","v":7.2398374517440267},null,1834,288.0834452023006,338.74949465380769,21.801409578353287,321.34019165643286,99.462322000711495,21.801409520852367,260.53767799928852,1.5481577014123133,347.00538360154485,null,149.54329787593051]
[225,"2008-07-09",7146918.8099999996,512905.2,1.9506849315068493,4.0000000037252903E-2,2.0000000018626451E-2,4.4721359591645804E-2,2.2925977880548762,2,1,3,26.56505117707799,24.519642680907662,null,"BH-4",null,null,null,null,null,null,null,{"$f":"INDIRECT(\"M\"&TEXT(3+VLOOKUP($P30,$AB$2:$AC$11,2,FALSE)*12+VLOOKUP(X$24,$AD$2:$AE$11,2,FALSE)*1,0))","v":125.75388612283803},239.53445329727259,null,80.455010616294103]
[225,"2010-07-20",7146918.8300000001,512905.19,2.0301369863013701,2.0000000484287739E-2,-1.0000000009313226E-2,2.2360680212323021E-2,1.1014370145071393,2,0,2,333.43494935653052,28.610459139639804,null,2836,null,null,null,null,null,null,null,76.664893797560921,74.450195987583541,null,1.5660278397140015]
[225,"2010-09-25",7146918.8399999999,512905.24,0.18356164383561643,9.9999997764825821E-3,4.9999999988358468E-2,5.0990195080677016E-2,27.778240603652403,2,1,3,78.690067769695219,76.644659273524894,null,186,null,null,null,null,null,null,null,83.254420388263483,93.122130005936697,null,6.9775243854364435]
[225,"2011-08-11",7146918.8600000003,512905.25,0.87671232876712324,2.0000000484287739E-2,1.0000000009313226E-2,2.2360680212323021E-2,2.5505150867180948,2,1,3,26.565050643469473,24.519642147299145,null,300,null,null,null,null,null,null,null,33.690067397708503,335.89776527175502,null,213.69311249351369]
[225,"2012-08-06",7146918.8899999997,512905.21,0.989041095890411,2.9999999329447746E-2,-3.9999999979045242E-2,4.9999999580904848E-2,5.0554016196759743,2,0,2,306.8698970455344,55.175511450635931]
[225,"2014-09-11",7146918.9000000004,512905.20500000002,2.0986301369863014,1.0000000707805157E-2,-5.0000000046566129E-3,1.1180340522661631E-2,0.53274468547930753,2,0,2,333.43495042374752,28.610458072422805,null,null,{"$f":"_xlfn.STDEV.S(Q25:Q34)","v":58.209984471552318},{"$f":"_xlfn.STDEV.S(R25:R34)","v":150.41541496637902},5.3967731653712487,179.36853623787806,38.43887884728268,17.879993232577572,26.182136531741801,97.307022099690812,134.81174396333657]
[225,"2015-09-17",7146918.9160000002,512905.22700000001,1.0164383561643835,1.5999999828636646E-2,2.1999999997206032E-2,2.7202940914420229E-2,2.6763001169173539,2,1,3,53.972626903333442,51.92721840716311,null,"Azimuth Variation from Principal Direction"]
[null,"Totals From August 2, 2003 to September 17, 2015",null,null,{"$f":"SUM(E27:E36)","v":12.084931506849315},{"$f":"C36-C27","v":0.196000000461936},{"$f":"D36-D27","v":7.0000000414438546E-3},0.19612496062882748,{"$f":"H37*100/E37","v":1.6228884749381551},{"$f":"IF(G37>0,2,0)","v":2},{"$f":"IF(H37>0,1,0)","v":1},3,2.0454084961703285,{"$f":"AVERAGE(N27:N36)","v":42.203390535705061},null,"Point","2004-07-28","2006-07-28","2008-07-09","2010-07-20","2010-09-25","2011-08-11","2012-08-06","2014-09-11","2015-09-17",null,"Stddev.","Mean","Min","Max"]
[1195,"2001-06-19",7147111.8300000001,512899.53,null,null,null,null,null,null,null,null,null,null,null,"81-1",{"$f":"INDIRECT(\"N\"&TEXT(3+VLOOKUP($P38,$AB$2:$AC$11,2,FALSE)*12+VLOOKUP(Q$37,$AD$2:$AE$11,2,FALSE)*1,0))","v":131.63353869609182},59.121339062108675,35.371844632902992,53.806793322422877,81.193206010566442,5.229449919897057,143.80679332242289,71.504420132632532,8.8067902255875126,null,{"$f":"_xlfn.STDEV.S(Q38:Y38)","v":48.373038119912735},{"$f":"AVERAGE(Q38:Y38)","v":65.608241702736976},{"$f":"MIN(Q38:Y38)","v":5.229449919897057},{"$f":"MAX(Q38:Y38)","v":143.80679332242289}]
[1195,"2003-08-20",7147111.9400000004,512899.53,null,null,null,null,null,null,null,null,null,null,null,223,{"$f":"INDIRECT(\"N\"&TEXT(3+VLOOKUP($P39,$AB$2:$AC$11,2,FALSE)*12+VLOOKUP(Q$37,$AD$2:$AE$11,2,FALSE)*1,0))","v":31.900156432704794},{"$f":"INDIRECT(\"N\"&TEXT(3+VLOOKUP($P39,$AB$2:$AC$11,2,FALSE)*12+VLOOKUP(R$37,$AD$2:$AE$11,2,FALSE)*1,0))","v":4.5224541469138826},19.440034841417098,7.1250163356608915,116.56505180602105,4.1849161255321956,52.125016057739771,45.000000389503327,37.775683646018166,null,{"$f":"_xlfn.STDEV.S(Q39:Y39)","v":35.28374963617398},{"$f":"AVERAGE(Q39:Y39)","v":35.404258864612352},{"$f":"MIN(Q39:Y39)","v":4.1849161255321956},{"$f":"MAX(Q39:Y39)","v":116.56505180602105}]
[1195,"2004-07-28",7147111.9479999999,512899.52299999999,{"$f":"(B40-B39)/365","v":0.9397260273972603},{"$f":"C40-C39","v":7.9999994486570358E-3},{"$f":"D40-D39","v":-7.0000000414438546E-3},{"$f":"(F40^2+G40^2)^0.5","v":1.063014542509776E-2},{"$f":"H40/E40*100","v":1.1311962332829977},{"$f":"IF(F40>0,2,0)","v":2},{"$f":"IF(G40>0,1,0)","v":0},{"$f":"SUM(J40:K40)","v":2},{"$f":"IF(L40=3,(ATAN(G40/F40)*180/PI()),IF(L40=1,(90+ATAN(ABS(F40)/ABS(G40))*180/PI()),IF(L40=0,(180+ATAN(ABS(G40)/ABS(F40))*180/PI()),IF(L40=2,(270+ATAN(ABS(F40)/ABS(G40))*180/PI()),\"ERROR\"))))","v":318.81407270930055},{"$f":"IF(AND(ABS($M$49-M40)>0,ABS($M$49-M40)<180),ABS($M$49-M40),ABS(360-MAX($M$49,M40)+MIN($M$49,M40)))","v":40.186683607820044},null,225,82.583086198008147,7.2398374517440267,24.519642680907662,28.610459139639804,76.644659273524894,24.519642147299145,55.175511450635931,28.610458072422805,51.92721840716311,null,25.731704908432569,42.203390535705061,7.2398374517440267,82.583086198008147]
[1195,"2006-07-28",7147111.9500000002,512899.5,2,2.0000003278255463E-3,-2.2999999986495823E-2,2.3086792776176385E-2,1.1543396388088192,2,0,2,274.96974154153793,{"$f":"IF(AND(ABS($M$49-M41)>0,ABS($M$49-M41)<180),ABS($M$49-M41),ABS(360-MAX($M$49,M41)+MIN($M$49,M41)))","v":84.031014775582662},null,1195,40.186683607820044,84.031014775582662,15.035487150805887,0.99924368287940979,179.00075631712059,27.564295393565938,44.000756984131272,48.120339481058707,37.928300345828518,null,52.592305916306131,52.985208637643666,0.99924368287940979,179.00075631712059]
[1195,"2008-07-09",7147112.0300000003,512899.52,1.9506849315068493,8.0000000074505806E-2,2.0000000018626451E-2,8.2462112589152037E-2,4.2273414459326535,2,1,3,14.036243467926477,15.035487150805887,null,1834,55.850154265557762,5.18410481405067,37.867810110494929,22.593407811425493,115.52872253285314,37.86781005299401,83.395921468569838,17.614558233553957,3.0717841336864922,null,37.396604731459121,42.10825260257625,3.0717841336864922,115.52872253285314]
[1195,"2010-07-20",7147112.0499999998,512899.52,2.0301369863013701,1.9999999552965164E-2,0,1.9999999552965164E-2,0.9851551736615769,2,0,2,0,0.99924368287940979,null,"BH-4",null,null,null,null,null,null,null,{"$f":"INDIRECT(\"N\"&TEXT(3+VLOOKUP($P43,$AB$2:$AC$11,2,FALSE)*12+VLOOKUP(X$37,$AD$2:$AE$11,2,FALSE)*1,0))","v":38.300717991970515},75.479849182464051,null,26.289615783422253,56.890283587217283,38.300717991970515,75.479849182464051]
[1195,"2010-09-25",7147112.0300000003,512899.52,0.18356164383561643,-1.9999999552965164E-2,0,1.9999999552965164E-2,10.895522144525799,0,0,0,180,179.00075631712059,null,2836,null,null,null,null,null,null,null,1.0242301943733167,1.1904676156040637,null,0.11754760783922569,1.1073489049886902,1.0242301943733167,1.1904676156040637]
[1195,"2011-08-11",7147112.0499999998,512899.53,0.87671232876712324,1.9999999552965164E-2,1.0000000009313226E-2,2.2360679379322786E-2,2.5505149917040058,2,1,3,26.565051710686529,27.564295393565938,null,186,null,null,null,null,null,null,null,2.2378087422661395,7.6299008754070741,null,3.8127849121265904,4.9338548088366068,2.2378087422661395,7.6299008754070741]
[1195,"2012-08-06",7147112.0599999996,512899.52,0.989041095890411,9.9999997764825821E-3,-1.0000000009313226E-2,1.4142135472265715E-2,1.429883503428528,2,0,2,314.99999933298932,44.000756984131272,null,300,null,null,null,null,null,null,null,38.792232666947712,19.000069459005772,null,13.995172818686635,28.896151062976742,19.000069459005772,38.792232666947712]
[1195,"2014-09-11",7147112.0860000001,512899.54800000001,2.0986301369863014,2.6000000536441803E-2,2.7999999991152436E-2,3.8209946707624579E-2,1.8207089488620067,2,1,3,47.121095798179297,48.120339481058707]
[1195,"2015-09-17",7147112.1119999997,512899.527,1.0164383561643835,2.5999999605119228E-2,-2.1000000007916242E-2,3.3421549631916868E-2,3.2881039395282095,2,0,2,321.07245597129207,37.928300345828518,null,"Stddev.",{"$f":"_xlfn.STDEV.S(Q38:Q47)","v":40.265879043549717},{"$f":"_xlfn.STDEV.S(R38:R47)","v":37.181867189951276},9.9136603705605939,20.712639644555175,40.943540583705463,14.706376433984854,40.864529260058397,22.742782207663911,25.534498916773764]
[null,"Totals From August 2, 2003 to September 17, 2015",null,null,{"$f":"SUM(E39:E48)","v":12.084931506849315},{"$f":"C48-C39","v":0.17199999932199717},{"$f":"D48-D39","v":-3.0000000260770321E-3},0.1720261601237541,{"$f":"H49*100/E49","v":1.4234765006839776},{"$f":"IF(F49>0,2,0)","v":2},{"$f":"IF(G49>0,1,0)","v":0},2,359.00075631712059,{"$f":"AVERAGE(N39:N48)","v":52.985208637643666},null,"Mean",{"$f":"AVERAGE(Q38:Q47)","v":68.430723840036507},{"$f":"AVERAGE(R38:R47)","v":32.019750050079985},26.446963883305717,22.626984058405693,113.78647918801724,19.873222727857673,75.700799856699945,32.356085100525448,26.978895987862749]
[1834,"2001-06-19","N/A","N/A",null,null,null,null,null,null,null,null,null,null,null,"Min",{"$f":"MIN(Q38:Q47)","v":31.900156432704794},{"$f":"MIN(R38:R47)","v":4.5224541469138826},15.035487150805887,0.99924368287940979,76.644659273524894,4.1849161255321956,44.000756984131272,1.0242301943733167,1.1904676156040637]
[1834,"2003-08-20",7146973.6200000001,512893.43,null,null,null,null,null,null,null,null,null,null,null,"Max",{"$f":"MAX(Q38:Q47)","v":131.63353869609182},{"$f":"MAX(R38:R47)","v":84.031014775582662},37.867810110494929,53.806793322422877,179.00075631712059,37.86781005299401,143.80679332242289,71.504420132632532,75.479849182464051]
[1834,"2004-07-28",7146973.6359999999,512893.38099999999,{"$f":"(B52-B51)/365","v":0.9397260273972603},{"$f":"C52-C51","v":1.5999999828636646E-2},{"$f":"D52-D51","v":-4.8999999999068677E-2},{"$f":"(F52^2+G52^2)^0.5","v":5.1546095821362679E-2},{"$f":"H52/E52*100","v":5.4852259401741623},{"$f":"IF(F52>0,2,0)","v":2},{"$f":"IF(G52>0,1,0)","v":0},{"$f":"SUM(J52:K52)","v":2},{"$f":"IF(L52=3,(ATAN(G52/F52)*180/PI()),IF(L52=1,(90+ATAN(ABS(F52)/ABS(G52))*180/PI()),IF(L52=0,(180+ATAN(ABS(G52)/ABS(F52))*180/PI()),IF(L52=2,(270+ATAN(ABS(F52)/ABS(G52))*180/PI()),\"ERROR\"))))","v":288.0834452023006},{"$f":"IF(AND(ABS($M$61-M52)>0,ABS($M$61-M52)<180),ABS($M$61-M52),ABS(360-MAX($M$61,M52)+MIN($M$61,M52)))","v":55.850154265557762}]
[1834,"2006-07-28",7146973.6900000004,512893.36,2,5.4000000469386578E-2,-2.1000000007916242E-2,5.7939624187823592E-2,2.8969812093911798,2,0,2,338.74949465380769,{"$f":"IF(AND(ABS($M$61-M53)>0,ABS($M$61-M53)<180),ABS($M$61-M53),ABS(360-MAX($M$61,M53)+MIN($M$61,M53)))","v":5.18410481405067}]
[1834,"2008-07-09",7146973.7400000002,512893.38,1.9506849315068493,4.9999999813735485E-2,2.0000000018626451E-2,5.3851647905320467E-2,2.760653298517131,2,1,3,21.801409578353287,37.867810110494929]
[1834,"2010-07-20",7146973.79,512893.34,2.0301369863013701,4.9999999813735485E-2,-3.9999999979045242E-2,6.4031242215789999E-2,3.1540355477413429,2,0,2,321.34019165643286,22.593407811425493]
[1834,"2010-09-25",7146973.7800000003,512893.4,0.18356164383561643,-9.9999997764825821E-3,5.9999999997671694E-2,6.0827625263939533E-2,33.137437643787955,0,1,1,99.462322000711495,115.52872253285314]
[1834,"2011-08-11",7146973.8300000001,512893.42,0.87671232876712324,4.9999999813735485E-2,1.9999999960418791E-2,5.3851647883702683E-2,6.1424535867348373,2,1,3,21.801409520852367,37.86781005299401]
[1834,"2012-08-06",7146973.8200000003,512893.36,0.989041095890411,-9.9999997764825821E-3,-5.9999999997671694E-2,6.0827625263939533E-2,6.1501615571573209,0,0,0,260.53767799928852,83.395921468569838]
[1834,"2014-09-11",7146973.8569999998,512893.36099999998,2.0986301369863014,3.6999999545514584E-2,9.9999998928979039E-4,3.7013510592034622E-2,1.7636986117614408,2,1,3,1.5481577014123133,17.614558233553957]
[1834,"2015-09-17",7146973.8700000001,512893.35800000001,1.0164383561643835,1.3000000268220901E-2,-2.9999999678693712E-3,1.3341664318253541E-2,1.3125896162163189,2,0,2,347.00538360154485,3.0717841336864922]
[null,"Totals From August 2, 2003 to September 17, 2015",null,null,{"$f":"SUM(E51:E60)","v":12.084931506849315},{"$f":"C60-C51","v":0.25},{"$f":"D60-D51","v":-7.19999999855645E-2},0.26016148830663099,{"$f":"H61*100/E61","v":2.1527758610727794},2,0,2,343.93359946785836,{"$f":"AVERAGE(N51:N60)","v":42.10825260257625}]
["BH-4","2001-06-19","N/A","N/A"]
["BH-4","2003-08-20","N/A","N/A"]
["BH-4","2004-07-28","N/A","N/A",null,null,null,null,null,{"$f":"IF(F64>0,2,0)","v":0},{"$f":"IF(G64>0,1,0)","v":0}]
["BH-4","2006-07-28","N/A","N/A",null,null,null,null,null,0,0]
["BH-4","2008-07-09","N/A","N/A",null,null,null,null,null,0,0]
["BH-4","2010-07-20","N/A","N/A",null,null,null,null,null,0,0]
["BH-4","2010-09-25","N/A","N/A",null,null,null,null,null,0,0]
["BH-4","2011-08-11","N/A","N/A",null,null,null,null,null,0,0]
["BH-4","2012-08-06",7146871.2869999995,513025.11300000001,null,null,null,null,null,0,0]
["BH-4","2014-09-11",7146871.2690000003,513025.13799999998,{"$f":"(B71-B70)/365","v":2.0986301369863014},{"$f":"C71-C70","v":-1.7999999225139618E-2},{"$f":"D71-D70","v":2.4999999965075403E-2},{"$f":"(F71^2+G71^2)^0.5","v":3.0805843120401639E-2},{"$f":"H71/E71*100","v":1.467902446337676},0,1,{"$f":"SUM(J71:K71)","v":1},{"$f":"IF(L71=3,(ATAN(G71/F71)*180/PI()),IF(L71=1,(90+ATAN(ABS(F71)/ABS(G71))*180/PI()),IF(L71=0,(180+ATAN(ABS(G71)/ABS(F71))*180/PI()),IF(L71=2,(270+ATAN(ABS(F71)/ABS(G71))*180/PI()),\"ERROR\"))))","v":125.75388612283803},{"$f":"IF(AND(ABS($M$73-M71)>0,ABS($M$73-M71)<180),ABS($M$73-M71),ABS(360-MAX($M$73,M71)+MIN($M$73,M71)))","v":38.300717991970515}]
["BH-4","2015-09-17",7146871.2589999996,513025.12099999998,1.0164383561643835,-1.0000000707805157E-2,-1.6999999992549419E-2,1.9723083275765579E-2,1.9404111578583387,0,0,0,239.53445329727259,{"$f":"IF(AND(ABS($M$73-M72)>0,ABS($M$73-M72)<180),ABS($M$73-M72),ABS(360-MAX($M$73,M72)+MIN($M$73,M72)))","v":75.479849182464051}]
[null,"Totals From August 2, 2003 to September 17, 2015",null,null,{"$f":"SUM(E63:E72)","v":3.1150684931506847},{"$f":"C72-C70","v":-2.7999999932944775E-2},{"$f":"D72-D70","v":7.999999972525984E-3},2.9120439485099174E-2,{"$f":"H73*100/E73","v":0.9348250142534037},0,1,1,164.05460411480854,{"$f":"AVERAGE(N63:N72)","v":56.890283587217283}]
[2836,"2001-06-19","N/A","N/A"]
[2836,"2003-08-20","N/A","N/A"]
[2836,"2004-07-28","N/A","N/A",null,null,null,null,null,{"$f":"IF(F76>0,2,0)","v":0},{"$f":"IF(G76>0,1,0)","v":0}]
[2836,"2006-07-28","N/A","N/A",null,null,null,null,null,0,0]
[2836,"2008-07-09","N/A","N/A",null,null,null,null,null,0,0]
[2836,"2010-07-20","N/A","N/A",null,null,null,null,null,0,0]
[2836,"2010-09-25","N/A","N/A",null,null,null,null,null,0,0]
[2836,"2011-08-11","N/A","N/A",null,null,null,null,null,0,0]
[2836,"2012-08-06",7146814.7120000003,513092.91899999999,null,null,null,null,null,0,0]
[2836,"2014-09-11",7146814.7439999999,513093.054,{"$f":"(B83-B82)/365","v":2.0986301369863014},{"$f":"C83-C82","v":3.1999999657273293E-2},{"$f":"D83-D82","v":0.13500000000931323},{"$f":"(F83^2+G83^2)^0.5","v":0.13874076538847571},{"$f":"H83/E83*100","v":6.6110155831323274},2,1,{"$f":"SUM(J83:K83)","v":3},{"$f":"IF(L83=3,(ATAN(G83/F83)*180/PI()),IF(L83=1,(90+ATAN(ABS(F83)/ABS(G83))*180/PI()),IF(L83=0,(180+ATAN(ABS(G83)/ABS(F83))*180/PI()),IF(L83=2,(270+ATAN(ABS(F83)/ABS(G83))*180/PI()),\"ERROR\"))))","v":76.664893797560921},{"$f":"IF(AND(ABS($M$85-M83)>0,ABS($M$85-M83)<180),ABS($M$85-M83),ABS(360-MAX($M$85,M83)+MIN($M$85,M83)))","v":1.0242301943733167}]
[2836,"2015-09-17",7146814.7759999996,513093.16899999999,1.0164383561643835,3.1999999657273293E-2,0.11499999999068677,0.11936917514971547,11.743867636023221,2,1,3,74.450195987583541,{"$f":"IF(AND(ABS($M$85-M84)>0,ABS($M$85-M84)<180),ABS($M$85-M84),ABS(360-MAX($M$85,M84)+MIN($M$85,M84)))","v":1.1904676156040637}]
[null,"Totals From August 2, 2003 to September 17, 2015",null,null,{"$f":"SUM(E75:E84)","v":3.1150684931506847},{"$f":"C84-C82","v":6.3999999314546585E-2},0.25,0.2580620078823343,{"$f":"H85*100/E85","v":8.2843124781927902},2,1,3,75.640663603187605,{"$f":"AVERAGE(N75:N84)","v":1.1073489049886902}]
[186,"2001-06-19","N/A","N/A"]
[186,"2003-08-20","N/A","N/A"]
[186,"2004-07-28","N/A","N/A",null,null,null,null,null,{"$f":"IF(F88>0,2,0)","v":0},{"$f":"IF(G88>0,1,0)","v":0}]
[186,"2006-07-28","N/A","N/A",null,null,null,null,null,0,0]
[186,"2008-07-09","N/A","N/A",null,null,null,null,null,0,0]
[186,"2010-07-20","N/A","N/A",null,null,null,null,null,0,0]
[186,"2010-09-25","N/A","N/A",null,null,null,null,null,0,0]
[186,"2011-08-11","N/A","N/A",null,null,null,null,null,0,0]
[186,"2012-08-06",7146818.4869999997,513088.61900000001,null,null,null,null,null,0,0]
[186,"2014-09-11",7146818.5089999996,513088.80499999999,{"$f":"(B95-B94)/365","v":2.0986301369863014},{"$f":"C95-C94","v":2.199999988079071E-2},{"$f":"D95-D94","v":0.18599999998696148},{"$f":"(F95^2+G95^2)^0.5","v":0.18729655626813982},{"$f":"H95/E95*100","v":8.9247053574244166},2,1,{"$f":"SUM(J95:K95)","v":3},{"$f":"IF(L95=3,(ATAN(G95/F95)*180/PI()),IF(L95=1,(90+ATAN(ABS(F95)/ABS(G95))*180/PI()),IF(L95=0,(180+ATAN(ABS(G95)/ABS(F95))*180/PI()),IF(L95=2,(270+ATAN(ABS(F95)/ABS(G95))*180/PI()),\"ERROR\"))))","v":83.254420388263483},{"$f":"IF(AND(ABS($M$97-M95)>0,ABS($M$97-M95)<180),ABS($M$97-M95),ABS(360-MAX($M$97,M95)+MIN($M$97,M95)))","v":2.2378087422661395}]
[186,"2015-09-17",7146818.5060000001,513088.86,1.0164383561643835,-2.9999995604157448E-3,5.4999999993015081E-2,5.508175738476536E-2,5.419094729228938,0,1,1,93.122130005936697,{"$f":"IF(AND(ABS($M$97-M96)>0,ABS($M$97-M96)<180),ABS($M$97-M96),ABS(360-MAX($M$97,M96)+MIN($M$97,M96)))","v":7.6299008754070741}]
[null,"Totals From August 2, 2003 to September 17, 2015",null,null,{"$f":"SUM(E87:E96)","v":3.1150684931506847},{"$f":"C96-C94","v":1.9000000320374966E-2},{"$f":"D96-D94","v":0.24099999997997656},0.24174780247713309,{"$f":"H97*100/E97","v":7.7605934832149144},2,1,3,85.492229130529623,{"$f":"AVERAGE(N87:N96)","v":4.9338548088366068}]
[300,"2001-06-19","N/A","N/A"]
[300,"2003-08-20","N/A","N/A"]
[300,"2004-07-28","N/A","N/A",null,null,null,null,null,{"$f":"IF(F100>0,2,0)","v":0},{"$f":"IF(G100>0,1,0)","v":0}]
[300,"2006-07-28","N/A","N/A",null,null,null,null,null,0,0]
[300,"2008-07-09","N/A","N/A",null,null,null,null,null,0,0]
[300,"2010-07-20","N/A","N/A",null,null,null,null,null,0,0]
[300,"2010-09-25","N/A","N/A",null,null,null,null,null,0,0]
[300,"2011-08-11","N/A","N/A",null,null,null,null,null,0,0]
[300,"2012-08-06",7146927.5559999999,513026.96399999998,null,null,null,null,null,0,0]
[300,"2014-09-11",7146927.574,513026.97600000002,{"$f":"(B107-B106)/365","v":2.0986301369863014},{"$f":"C107-C106","v":1.8000000156462193E-2},{"$f":"D107-D106","v":1.2000000046100467E-2},{"$f":"(F107^2+G107^2)^0.5","v":2.1633307808540288E-2},{"$f":"H107/E107*100","v":1.0308299412685646},2,1,{"$f":"SUM(J107:K107)","v":3},{"$f":"IF(L107=3,(ATAN(G107/F107)*180/PI()),IF(L107=1,(90+ATAN(ABS(F107)/ABS(G107))*180/PI()),IF(L107=0,(180+ATAN(ABS(G107)/ABS(F107))*180/PI()),IF(L107=2,(270+ATAN(ABS(F107)/ABS(G107))*180/PI()),\"ERROR\"))))","v":33.690067397708503},{"$f":"IF(AND(ABS($M$109-M107)>0,ABS($M$109-M107)<180),ABS($M$109-M107),ABS(360-MAX($M$109,M107)+MIN($M$109,M107)))","v":38.792232666947712}]
[300,"2015-09-17",7146927.6119999997,513026.95899999997,1.0164383561643835,3.7999999709427357E-2,-1.700000005075708E-2,4.1629316348484754E-2,4.0956065949317892,2,0,2,335.89776527175502,{"$f":"IF(AND(ABS($M$109-M108)>0,ABS($M$109-M108)<180),ABS($M$109-M108),ABS(360-MAX($M$109,M108)+MIN($M$109,M108)))","v":19.000069459005772}]
[null,"Totals From August 2, 2003 to September 17, 2015",null,null,{"$f":"SUM(E99:E108)","v":3.1150684931506847},{"$f":"C108-C106","v":5.5999999865889549E-2},{"$f":"D108-D106","v":-5.0000000046566129E-3},5.6222771054317451E-2,{"$f":"H109*100/E109","v":1.804864682042733},2,0,2,354.89783473076079,{"$f":"AVERAGE(N99:N108)","v":28.896151062976742}]
["BH-4 Cable","2001-06-19","N/A","N/A"]
["BH-4 Cable","2003-08-20","N/A","N/A"]
["BH-4 Cable","2004-07-28","N/A","N/A",null,null,null,null,null,{"$f":"IF(F112>0,2,0)","v":0},{"$f":"IF(G112>0,1,0)","v":0}]
["BH-4 Cable","2006-07-28","N/A","N/A",null,null,null,null,null,0,0]
["BH-4 Cable","2008-07-09","N/A","N/A",null,null,null,null,null,0,0]
["BH-4 Cable","2010-07-20","N/A","N/A",null,null,null,null,null,0,0]
["BH-4 Cable","2010-09-25","N/A","N/A",null,null,null,null,null,0,0]
["BH-4 Cable","2011-08-11","N/A","N/A",null,null,null,null,null,0,0]
["BH-4 Cable","2012-08-06",7146871.3269999996,513025.21500000003,null,null,null,null,null,0,0]
["BH-4 Cable","2014-09-11",7146871.2599999998,513025.10700000002,{"$f":"(B119-B118)/365","v":2.0986301369863014},{"$f":"C119-C118","v":-6.6999999806284904E-2},{"$f":"D119-D118","v":-0.10800000000745058},{"$f":"(F119^2+G119^2)^0.5","v":0.12709445296963789},{"$f":"H119/E119*100","v":6.0560672759683856},0,0,{"$f":"SUM(J119:K119)","v":0},{"$f":"IF(L119=3,(ATAN(G119/F119)*180/PI()),IF(L119=1,(90+ATAN(ABS(F119)/ABS(G119))*180/PI()),IF(L119=0,(180+ATAN(ABS(G119)/ABS(F119))*180/PI()),IF(L119=2,(270+ATAN(ABS(F119)/ABS(G119))*180/PI()),\"ERROR\"))))","v":238.18576137816737},{"$f":"IF(AND(ABS($M$109-M119)>0,ABS($M$109-M119)<180),ABS($M$109-M119),ABS(360-MAX($M$109,M119)+MIN($M$109,M119)))","v":116.71207335259342}]
["BH-4 Cable","2015-09-17",7146871.3660000004,513025.212,1.0164383561643835,0.10600000061094761,0.10499999998137355,0.14920120685037819,14.678824932719149,2,1,3,44.728457884124538,{"$f":"IF(AND(ABS($M$109-M120)>0,ABS($M$109-M120)<180),ABS($M$109-M120),ABS(360-MAX($M$109,M120)+MIN($M$109,M120)))","v":49.830623153363746}]
[null,"Totals From August 2, 2003 to September 17, 2015",null,null,{"$f":"SUM(E111:E120)","v":3.1150684931506847},{"$f":"C120-C118","v":3.9000000804662704E-2},{"$f":"D120-D118","v":-3.0000000260770321E-3},3.9115215235508469E-2,{"$f":"H121*100/E121","v":1.2556775339455226},2,0,2,355.60129469731902,{"$f":"AVERAGE(N111:N120)","v":83.271348252978584}]

{"sheet":"Wolv Stats","index":8,"n_rows":92,"n_cols":34,"rows_kept":92,"cut":false,"hidden":false,"merged":[[22,15,22,24],[23,15,23,24],[34,15,34,26]]}
["Monitor","Date","Northing\n(m)","Easting\n(m)","duration","dn","de","Movement","Movement Rate (cm/y)","N/S","E/W","Quadrant","Azimuth","Variation",null,"Point","2004-07-28","2004-09-23","2005-09-17","2006-07-28","2008-07-09","2010-07-20","2010-09-25","2011-08-11","2012-08-06","2014-09-13","2015-09-17","Average","Stddev",null,"Point",null,"Date"]
["80-1","2003-08-21",7148407.9800000004,513543.04,null,null,null,null,null,null,null,null,null,null,null,"80-1",{"$f":"INDIRECT(\"I\"&TEXT(3+VLOOKUP($P2,$AE$2:$AF$8,2,FALSE)*13+VLOOKUP(Q$1,$AG$2:$AH$13,2,FALSE)*1,0))","v":4.5279644275236715},14.318681188592814,6.4302582101172598,2.5992509832706125,3.7320788127649411,1.5576671286551451,17.227333497746507,2.5505150213959085,3.645502011628917,3.69665849713929,4.5640913610073808,{"$f":"AVERAGE(Q2:AA2)","v":5.8954546490765862},{"$f":"_xlfn.STDEV.S(Q2:AA2)","v":5.0866291670024522},null,"80-1",0,"2004-07-28",0]
["80-1","2004-07-28",7148408.0099999998,513543.07,{"$f":"(B3-B2)/365","v":0.93698630136986305},{"$f":"C3-C2","v":2.9999999329447746E-2},{"$f":"D3-D2","v":3.0000000027939677E-2},{"$f":"(F3^2+G3^2)^0.5","v":4.2426406416797145E-2},{"$f":"H3/E3*100","v":4.5279644275236715},{"$f":"IF(F3>0,2,0)","v":2},{"$f":"IF(G3>0,1,0)","v":1},{"$f":"SUM(J3:K3)","v":3},{"$f":"IF(L3=3,(ATAN(G3/F3)*180/PI()),IF(L3=1,(90+ATAN(ABS(F3)/ABS(G3))*180/PI()),IF(L3=0,(180+ATAN(ABS(G3)/ABS(F3))*180/PI()),IF(L3=2,(270+ATAN(ABS(F3)/ABS(G3))*180/PI()),\"ERROR\"))))","v":45.000000667010674},{"$f":"IF(AND(ABS($M$14-M3)>0,ABS($M$14-M3)<180),ABS($M$14-M3),ABS(360-MAX($M$14,M3)+MIN($M$14,M3)))","v":25.389655283465039},null,"80-2",10.511207891994335,14.318680855210042,9.1504178299019934,3.675895994692556,4.6421567070903249,2.9962325534868999,17.227333497746507,5.8160691263897224,5.1555183391820245,6.709424864650348,4.4335995845784346,{"$f":"AVERAGE(Q3:AA3)","v":7.6942306586293796},{"$f":"_xlfn.STDEV.S(Q3:AA3)","v":4.6252210267968588},null,"80-2",1,"2004-09-23",1]
["80-1","2004-09-23",7148408.0300000003,513543.06,{"$f":"(B4-B3)/365","v":0.15616438356164383},{"$f":"C4-C3","v":2.0000000484287739E-2},{"$f":"D4-D3","v":-1.0000000009313226E-2},{"$f":"(F4^2+G4^2)^0.5","v":2.2360680212323021E-2},{"$f":"H4/E4*100","v":14.318681188592814},{"$f":"IF(F4>0,2,0)","v":2},{"$f":"IF(G4>0,1,0)","v":0},{"$f":"SUM(J4:K4)","v":2},{"$f":"IF(L4=3,(ATAN(G4/F4)*180/PI()),IF(L4=1,(90+ATAN(ABS(F4)/ABS(G4))*180/PI()),IF(L4=0,(180+ATAN(ABS(G4)/ABS(F4))*180/PI()),IF(L4=2,(270+ATAN(ABS(F4)/ABS(G4))*180/PI()),\"ERROR\"))))","v":333.43494935653052},{"$f":"IF(AND(ABS($M$14-M4)>0,ABS($M$14-M4)<180),ABS($M$14-M4),ABS(360-MAX($M$14,M4)+MIN($M$14,M4)))","v":96.95470659394519},null,26,3.8480298908260955,6.4035086288002505,2.8756989234325117,3.6758960353459651,1.5379213467629473,0.69660991192671862,21.791044764703752,1.1406249745050445,4.2896505768697235,1.6796270753718596,4.3093781719425825,4.749817300044314,5.9010153250071982,null,26,2,"2005-09-17",2]
["80-1","2005-09-17",7148408.0099999998,513543.12,0.98356164383561639,-2.0000000484287739E-2,5.9999999997671694E-2,6.3245553354303999E-2,6.4302582101172598,0,1,1,108.43494923980367,38.045293289327958,null,"26-A",3.0186430219657066,19.210526333680672,7.4017830232589636,2.5992509832706125,2.7606533007335607,1.101437009378174,17.227333628105676,2.5505150867180948,2.0221606667032281,2.4809322233676983,7.161681622133373,6.1395378999377961,6.3144295611390362,null,"26-A",3,"2006-07-28",3]
["80-1","2006-07-28",7148408.0199999996,513543.14,0.86027397260273974,9.9999997764825821E-3,2.0000000018626451E-2,2.2360679691697874E-2,2.5992509832706125,2,1,3,63.434949356530538,6.9547065939451755,null,"BH-14",0,23.088179365632094,12.242846853516133,17.781612643579887,4.0038498875612181,9.9739361660177739,16.343283565600277,1.6130873226106062,2.2608443113438801,9.7792842952902639,3.0084123880649862,9.0995760726561024,7.6375617207900701,null,"BH-14",4,"2008-07-09",4]
["80-1","2008-07-09",7148408.04,513543.21,1.9506849315068493,2.0000000484287739E-2,7.0000000006984919E-2,7.2801099032565431E-2,3.7320788127649411,2,1,3,74.054603734109051,3.6649477836333375,null,1483,2.1345029259645187,9.0559288550473429,3.2151291228374186,3.675895932642617,2.7606532979630236,1.9703103903308383,17.227333467663623,1.6130873273053081,2.859767006857056,0.59549959636843908,2.5023986007474139,4.3282278657934183,4.7961169707319549,null,1483,5,"2010-07-20",5]
["80-1","2010-07-20",7148408.0300000003,513543.24,2.0301369863013701,-9.9999997764825821E-3,2.9999999969732016E-2,3.1622776502286648E-2,1.5576671286551451,0,1,1,108.43494845606614,38.045292505590425,null,1495,6.2230919478105342,23.088179344956576,5.0835654584264178,3.2878213040617741,2.760653315694463,1.7760137727047314,7.7042976826522187,2.5505150273342889,3.6455020067320829,3.6101026304374879,0.7974862371993624,5.5024753389099947,6.1562081971345401,null,1495,6,"2010-09-25",6]
["80-1","2010-09-25",7148408.04,513543.27,0.18356164383561643,9.9999997764825821E-3,3.0000000027939677E-2,3.1622776557507282E-2,17.227333497746507,2,1,3,71.565051577284393,1.1753956268086796,null,null,null,null,null,null,null,null,null,null,null,null,null,null,null,null,null,null,"2011-08-11",7]
["80-1","2011-08-11",7148408.0499999998,513543.29,0.87671232876712324,9.9999997764825821E-3,1.9999999960418791E-2,2.236067963963536E-2,2.5505150213959085,2,1,3,63.434949289829483,6.9547066606462309,null,null,null,null,null,null,null,null,null,null,null,null,null,null,null,null,null,null,"2012-08-06",8]
["80-1","2012-08-06",7148408.0700000003,513543.32,0.989041095890411,2.0000000484287739E-2,3.0000000027939677E-2,3.6055513046521617E-2,3.645502011628917,2,1,3,56.309931858318066,14.079724092157647,null,null,null,null,null,null,null,null,null,null,null,null,null,null,null,null,null,null,"2014-09-13",9]
["80-1","2014-09-13",7148408.0590000004,513543.397,2.1041095890410957,-1.0999999940395355E-2,7.6999999990221113E-2,7.7781745912410258E-2,3.69665849713929,0,1,1,98.130102311709848,27.740446361234135,null,null,null,null,null,null,null,null,null,null,null,null,null,null,null,null,null,null,"2015-09-17",10]
["80-1","2015-09-17",7148408.0990000004,513543.37400000001,1.010958904109589,4.0000000037252903E-2,-2.2999999986495823E-2,4.6141088005800641E-2,4.5640913610073808,2,0,2,330.10109819898116,100.28855775149455,null,"min",{"$f":"MIN(Q2:Q11)","v":0},{"$f":"MIN(R2:R11)","v":6.4035086288002505},2.8756989234325117,2.5992509832706125,1.5379213467629473,0.69660991192671862,7.7042976826522187,1.1406249745050445,2.0221606667032281,{"$f":"MIN(Z2:Z11)","v":0.59549959636843908},0.7974862371993624]
[null,null,null,"Totals",{"$f":"SUM(E3:E13)","v":12.082191780821919},{"$f":"C13-C2","v":0.11899999994784594},{"$f":"D13-D2","v":0.33400000003166497},0.35456593182191026,{"$f":"H14*100/E14","v":2.934615989002205},{"$f":"IF(G14>0,2,0)","v":2},{"$f":"IF(H14>0,1,0)","v":1},3,{"$f":"IF(L14=3,(ATAN(G14/F14)*180/PI()),IF(L14=1,(90+ATAN(ABS(F14)/ABS(G14))*180/PI()),IF(L14=0,(180+ATAN(ABS(G14)/ABS(F14))*180/PI()),IF(L14=2,(270+ATAN(ABS(F14)/ABS(G14))*180/PI()),\"ERROR\"))))","v":70.389655950475714},{"$f":"AVERAGE(N3:N13)","v":32.663039322022584},null,"Q1",{"$f":"QUARTILE(Q2:Q11,1)","v":2.5765729739651126},{"$f":"QUARTILE(R2:R11,1)","v":11.687304855128692},4.1493472906319182,2.9435361436661935,2.7606532993482924,1.3295520690166596,16.78530851663195,1.6130873249579571,2.560305659100468,{"$f":"QUARTILE(Z2:Z11,1)","v":2.0802796493697788},2.7554054944062001]
["80-2","2003-08-21",7148290.0499999998,513549.41,null,null,null,null,null,null,null,null,null,null,null,"Median",{"$f":"MEDIAN(Q2:Q11)","v":3.8480298908260955},{"$f":"MEDIAN(R2:R11)","v":14.318681188592814},6.4302582101172598,3.675895932642617,2.760653315694463,1.7760137727047314,17.227333497746507,2.5505150213959085,3.6455020067320829,{"$f":"MEDIAN(Z2:Z11)","v":3.6101026304374879},4.3093781719425825]
["80-2","2004-07-28",7148290.0899999999,513549.5,{"$f":"(B16-B15)/365","v":0.93698630136986305},{"$f":"C16-C15","v":4.0000000037252903E-2},{"$f":"D16-D15","v":9.0000000025611371E-2},{"$f":"(F16^2+G16^2)^0.5","v":9.8488578056494858E-2},{"$f":"H16/E16*100","v":10.511207891994335},{"$f":"IF(F16>0,2,0)","v":2},{"$f":"IF(G16>0,1,0)","v":1},{"$f":"SUM(J16:K16)","v":3},{"$f":"IF(L16=3,(ATAN(G16/F16)*180/PI()),IF(L16=1,(90+ATAN(ABS(F16)/ABS(G16))*180/PI()),IF(L16=0,(180+ATAN(ABS(G16)/ABS(F16))*180/PI()),IF(L16=2,(270+ATAN(ABS(F16)/ABS(G16))*180/PI()),\"ERROR\"))))","v":66.037511011669011},{"$f":"IF(AND(ABS($M$14-M16)>0,ABS($M$14-M16)<180),ABS($M$14-M16),ABS(360-MAX($M$14,M16)+MIN($M$14,M16)))","v":4.3521449388067026},null,"Q3",{"$f":"QUARTILE(Q2:Q11,3)","v":5.3755281876671024},{"$f":"QUARTILE(R2:R11,3)","v":21.149352839318624},8.276100426580479,3.6758960150192603,3.8679643501630796,2.4832714719088691,17.227333562926091,2.5505150570261916,3.9675762942493202,{"$f":"QUARTILE(Z2:Z11,3)","v":5.2030416808948186},4.4988454727929081]
["80-2","2004-09-23",7148290.0800000001,513549.48,{"$f":"(B17-B16)/365","v":0.15616438356164383},{"$f":"C17-C16","v":-9.9999997764825821E-3},{"$f":"D17-D16","v":-2.0000000018626451E-2},{"$f":"(F17^2+G17^2)^0.5","v":2.2360679691697874E-2},{"$f":"H17/E17*100","v":14.318680855210042},{"$f":"IF(F17>0,2,0)","v":0},{"$f":"IF(G17>0,1,0)","v":0},0,{"$f":"IF(L17=3,(ATAN(G17/F17)*180/PI()),IF(L17=1,(90+ATAN(ABS(F17)/ABS(G17))*180/PI()),IF(L17=0,(180+ATAN(ABS(G17)/ABS(F17))*180/PI()),IF(L17=2,(270+ATAN(ABS(F17)/ABS(G17))*180/PI()),\"ERROR\"))))","v":243.43494935653052},{"$f":"IF(AND(ABS($M$14-M17)>0,ABS($M$14-M17)<180),ABS($M$14-M17),ABS(360-MAX($M$14,M17)+MIN($M$14,M17)))","v":173.04529340605481},null,"Max",{"$f":"MAX(Q2:Q11)","v":10.511207891994335},{"$f":"MAX(R2:R11)","v":23.088179365632094},12.242846853516133,17.781612643579887,4.6421567070903249,9.9739361660177739,21.791044764703752,5.8160691263897224,5.1555183391820245,{"$f":"MAX(Z2:Z11)","v":9.7792842952902639},7.161681622133373]
["80-2","2005-09-17",7148290.0800000001,513549.57,0.98356164383561639,0,9.0000000025611371E-2,9.0000000025611371E-2,9.1504178299019934,0,1,1,90,19.610344049524286,null,"Bottom",{"$f":"Q14","v":2.5765729739651126},{"$f":"R14","v":11.687304855128692},4.1493472906319182,2.9435361436661935,2.7606532993482924,1.3295520690166596,16.78530851663195,1.6130873249579571,2.560305659100468,{"$f":"Z14","v":2.0802796493697788},2.7554054944062001]
["80-2","2006-07-28",7148290.0899999999,513549.6,0.86027397260273974,9.9999997764825821E-3,2.9999999969732016E-2,3.1622776502286648E-2,3.675895994692556,2,1,3,71.565051543933862,1.1753955934581484,null,"2Q Box",{"$f":"Q15-Q14","v":1.2714569168609828},{"$f":"R15-R14","v":2.6313763334641216},2.2809109194853416,0.73235978897642351,1.6346170639280899E-8,0.44646170368807181,0.44202498111455668,0.93742769643795132,1.0851963476316149,{"$f":"Z15-Z14","v":1.5298229810677091},1.5539726775363825]
["80-2","2008-07-09",7148290.0800000001,513549.69,1.9506849315068493,-9.9999997764825821E-3,9.0000000025611371E-2,9.0553851382145514E-2,4.6421567070903249,0,1,1,96.340191603560072,25.950535653084359,null,"3Q Box",{"$f":"Q16-Q15","v":1.5274982968410069},6.8306716507258098,1.8458422164632191,8.2376643284476359E-8,1.1073110344686166,0.70725769920413772,6.5179584396446444E-8,3.5630283168330834E-8,0.32207428751723732,{"$f":"Z16-Z15","v":1.5929390504573306},0.18946730085032559]
["80-2","2010-07-20",7148290.0899999999,513549.75,2.0301369863013701,9.9999997764825821E-3,5.9999999997671694E-2,6.0827625263939533E-2,2.9962325534868999,2,1,3,80.537677999288505,10.148022048812791,null,"Whisker -",{"$f":"Q14-Q13","v":2.5765729739651126},{"$f":"R14-R13","v":5.2837962263284419},1.2736483671994066,0.34428516039558099,1.2227319525853451,0.63294215708994095,9.0810108339797324,0.47246235045291263,0.5381449923972399,{"$f":"Z14-Z13","v":1.4847800530013398},1.9579192572068376]
["80-2","2010-09-25",7148290.0800000001,513549.78,0.18356164383561643,-9.9999997764825821E-3,3.0000000027939677E-2,3.1622776557507282E-2,17.227333497746507,0,1,1,108.43494842271562,38.045292472239908,null,"Whisker +",{"$f":"Q17-Q16","v":5.1356797043272326},{"$f":"R17-R16","v":1.9388265263134699},3.9667464269356536,14.105716628560627,0.77419235692724531,7.4906646941089043,4.5637112017776609,3.2655540693635308,1.1879420449327043,{"$f":"Z17-Z16","v":4.5762426143954453},2.6628361493404649]
["80-2","2011-08-11",7148290.0899999999,513549.83,0.87671232876712324,9.9999997764825821E-3,4.9999999988358468E-2,5.0990195080677016E-2,5.8160691263897224,2,1,3,78.690067769695219,8.3004118192195051]
["80-2","2012-08-06",7148290.0800000001,513549.88,0.989041095890411,-9.9999997764825821E-3,4.9999999988358468E-2,5.0990195080677016E-2,5.1555183391820245,0,1,1,101.30993223030478,30.920276279829068,null,"Azimuth"]
["80-2","2014-09-13",7148290.0729999999,513550.02100000001,2.1041095890410957,-7.0000002160668373E-3,0.14100000000325963,0.14117365194661555,6.709424864650348,0,1,1,92.842137971173628,22.452482020697914,null,"Point","2004-07-28","2004-09-23","2005-09-17","2006-07-28","2008-07-09","2010-07-20","2010-09-25","2011-08-11","2012-08-06","2014-09-13","2015-09-17",null,"Stddev"]
["80-2","2015-09-17",7148290.108,513549.99300000002,1.010958904109589,3.5000000149011612E-2,-2.7999999991152436E-2,4.4821869772861435E-2,4.4335995845784346,2,0,2,321.34019187373423,109.04946407674149,null,"80-1",{"$f":"INDIRECT(\"M\"&TEXT(3+VLOOKUP($P26,$AE$2:$AF$8,2,FALSE)*13+VLOOKUP(Q$25,$AG$2:$AH$12,2,FALSE)*1,0))","v":45.000000667010674},{"$f":"INDIRECT(\"M\"&TEXT(3+VLOOKUP($P26,$AE$2:$AF$8,2,FALSE)*13+VLOOKUP(R$25,$AG$2:$AH$13,2,FALSE)*1,0))","v":333.43494935653052},108.43494923980367,63.434949356530538,74.054603734109051,108.43494845606614,71.565051577284393,63.434949289829483,56.309931858318066,98.130102311709848,330.10109819898116,null,{"$f":"_xlfn.STDEV.S(Q26:AA26)","v":105.30206419304317}]
[null,null,null,"Totals",{"$f":"SUM(E16:E26)","v":12.082191780821919},{"$f":"C26-C15","v":5.8000000193715096E-2},{"$f":"D26-D15","v":0.58300000004237518},0.58587797370432049,{"$f":"H27*100/E27","v":4.8491034104779356},{"$f":"IF(G27>0,2,0)","v":2},{"$f":"IF(H27>0,1,0)","v":1},3,{"$f":"IF(L27=3,(ATAN(G27/F27)*180/PI()),IF(L27=1,(90+ATAN(ABS(F27)/ABS(G27))*180/PI()),IF(L27=0,(180+ATAN(ABS(G27)/ABS(F27))*180/PI()),IF(L27=2,(270+ATAN(ABS(F27)/ABS(G27))*180/PI()),\"ERROR\"))))","v":84.31859966397532},{"$f":"AVERAGE(N16:N26)","v":40.277242032588084},null,"80-2",{"$f":"INDIRECT(\"M\"&TEXT(3+VLOOKUP($P27,$AE$2:$AF$8,2,FALSE)*13+VLOOKUP(Q$25,$AG$2:$AH$13,2,FALSE)*1,0))","v":66.037511011669011},243.43494935653052,90,71.565051543933862,96.340191603560072,80.537677999288505,108.43494842271562,78.690067769695219,101.30993223030478,92.842137971173628,321.34019187373423,null,81.787159785106795]
[26,"2003-08-21",7148341.4500000002,513483.53,null,null,null,null,null,null,null,null,null,null,null,26,33.69006724378297,0,135.00000066701065,18.434948689519882,90,134.99999933298932,90,0,44.999999777663113,115.11483575662284,9.2461126120205499,null,53.38208956838605]
[26,"2004-07-28",7148341.4800000004,513483.55,{"$f":"(B29-B28)/365","v":0.93698630136986305},{"$f":"C29-C28","v":3.0000000260770321E-2},{"$f":"D29-D28","v":1.9999999960418791E-2},{"$f":"(F29^2+G29^2)^0.5","v":3.6055512949658211E-2},{"$f":"H29/E29*100","v":3.8480298908260955},{"$f":"IF(F29>0,2,0)","v":2},{"$f":"IF(G29>0,1,0)","v":1},{"$f":"SUM(J29:K29)","v":3},{"$f":"IF(L29=3,(ATAN(G29/F29)*180/PI()),IF(L29=1,(90+ATAN(ABS(F29)/ABS(G29))*180/PI()),IF(L29=0,(180+ATAN(ABS(G29)/ABS(F29))*180/PI()),IF(L29=2,(270+ATAN(ABS(F29)/ABS(G29))*180/PI()),\"ERROR\"))))","v":33.69006724378297},{"$f":"IF(AND(ABS($M$14-M29)>0,ABS($M$14-M29)<180),ABS($M$14-M29),ABS(360-MAX($M$14,M29)+MIN($M$14,M29)))","v":36.699588706692744},null,"26-A",44.999999332989347,270,74.054604438875032,243.43494935653052,68.198590973655556,296.56505277790353,108.43495005689172,26.565050643469473,90,126.43085848487644,327.40741878761378,null,109.83006294366295]
[26,"2004-09-23",7148341.4900000002,513483.55,{"$f":"(B30-B29)/365","v":0.15616438356164383},{"$f":"C30-C29","v":9.9999997764825821E-3},{"$f":"D30-D29","v":0},{"$f":"(F30^2+G30^2)^0.5","v":9.9999997764825821E-3},{"$f":"H30/E30*100","v":6.4035086288002505},{"$f":"IF(F30>0,2,0)","v":2},{"$f":"IF(G30>0,1,0)","v":0},2,0,{"$f":"IF(AND(ABS($M$14-M30)>0,ABS($M$14-M30)<180),ABS($M$14-M30),ABS(360-MAX($M$14,M30)+MIN($M$14,M30)))","v":70.389655950475714},null,"BH-14",0,213.69006732074575,274.76364158492447,78.690067431914187,39.805571278153415,249.77514073721144,90,314.99999949974199,26.565051577284397,64.680312980674927,350.53767786408366,null,127.51513871449322]
[26,"2005-09-17",7148341.4699999997,513483.57,0.98356164383561639,-2.0000000484287739E-2,2.0000000018626451E-2,2.8284271603075936E-2,2.8756989234325117,0,1,1,{"$f":"IF(L31=3,(ATAN(G31/F31)*180/PI()),IF(L31=1,(90+ATAN(ABS(F31)/ABS(G31))*180/PI()),IF(L31=0,(180+ATAN(ABS(G31)/ABS(F31))*180/PI()),IF(L31=2,(270+ATAN(ABS(F31)/ABS(G31))*180/PI()),\"ERROR\"))))","v":135.00000066701065},64.610344716534939,null,1483,90,314.99999933298932,71.565049976458809,341.5650507768716,111.80140904934483,270,71.565051543933862,134.99999933298932,45.000000667010674,118.61045987838899,18.434948614481179,null,111.75270798134764]
[26,"2006-07-28",7148341.5,513483.58,0.86027397260273974,3.0000000260770321E-2,1.0000000009313226E-2,3.1622776852017344E-2,3.6758960353459651,2,1,3,18.434948689519882,51.954707260955828,null,1495,59.036243242319934,326.30993275621705,90,45.000000667010674,68.198590030640474,56.309933038413853,45.000000667010674,116.56505064346946,56.309931807009562,20.820892980470568,187.12501593843371,null,88.277694937925602]
[26,"2008-07-09",7148341.5,513483.61,1.9506849315068493,0,2.9999999969732016E-2,2.9999999969732016E-2,1.5379213467629473,0,1,1,90,19.610344049524286,null,"stddev",{"$f":"_xlfn.STDEV.S(Q26:Q32)","v":28.097548528016741},{"$f":"_xlfn.STDEV.S(R26:R32)","v":116.1465870471951},71.37387035677051,120.72685892462768,23.411505480842166,98.590663715004467,22.712344696645701,103.86742198871902,26.462566289178657,37.128725963332684,151.15800225142559]
[26,"2010-07-20",7148341.4900000002,513483.62,2.0301369863013701,-9.9999997764825821E-3,1.0000000009313226E-2,1.4142135472265715E-2,0.69660991192671862,0,1,1,134.99999933298932,64.610343382513605]
[26,"2010-09-25",7148341.4900000002,513483.66,0.18356164383561643,0,3.9999999979045242E-2,3.9999999979045242E-2,21.791044764703752,0,1,1,90,19.610344049524286,null,"Azimuth Variation from Principal Direction"]
[26,"2011-08-11",7148341.5,513483.66,0.87671232876712324,9.9999997764825821E-3,0,9.9999997764825821E-3,1.1406249745050445,2,0,2,0,70.389655950475714,null,"Point","2004-07-28","2004-09-23","2005-09-17","2006-07-28","2008-07-09","2010-07-20","2010-09-25","2011-08-11","2012-08-06","2014-09-13","2015-09-17",null,"Stddev","Mean","Min","Max"]
[26,"2012-08-06",7148341.5300000003,513483.69,0.989041095890411,3.0000000260770321E-2,3.0000000027939677E-2,4.2426407075341649E-2,4.2896505768697235,2,1,3,44.999999777663113,25.3896561728126,null,"80-1",{"$f":"INDIRECT(\"N\"&TEXT(3+VLOOKUP($P37,$AE$2:$AF$8,2,FALSE)*13+VLOOKUP(Q$36,$AG$2:$AH$13,2,FALSE)*1,0))","v":25.389655283465039},96.95470659394519,38.045293289327958,6.9547065939451755,3.6649477836333375,38.045292505590425,1.1753956268086796,6.9547066606462309,14.079724092157647,27.740446361234135,100.28855775149455,null,{"$f":"_xlfn.STDEV.S(Q37:AA37)","v":35.130098107680553},{"$f":"AVERAGE(Q37:AA37)","v":32.663039322022584},{"$f":"MIN(Q37:AA37)","v":1.1753956268086796},{"$f":"MAX(Q37:AA37)","v":100.28855775149455}]
[26,"2014-09-13",7148341.5149999997,513483.72200000001,2.1041095890410957,-1.5000000596046448E-2,3.2000000006519258E-2,3.5341194353029813E-2,1.6796270753718596,0,1,1,115.11483575662284,44.725179806147125,null,"80-2",4.3521449388067026,173.04529340605481,19.610344049524286,1.1753955934581484,25.950535653084359,10.148022048812791,38.045292472239908,8.3004118192195051,30.920276279829068,22.452482020697914,109.04946407674149,null,53.056064891976945,40.277242032588084,1.1753955934581484,173.04529340605481]
[26,"2015-09-17",7148341.5580000002,513483.72899999999,1.010958904109589,4.3000000528991222E-2,6.9999999832361937E-3,4.3566042341008575E-2,4.3093781719425825,2,1,3,9.2461126120205499,61.14354333845516,null,26,36.699588706692744,70.389655950475714,64.610344716534939,51.954707260955828,19.610344049524286,64.610343382513605,19.610344049524286,70.389655950475714,25.3896561728126,44.725179806147125,61.14354333845516,null,20.010678733729716,48.103033034919264,19.610344049524286,70.389655950475714]
[null,null,null,"Totals",{"$f":"SUM(E29:E39)","v":12.082191780821919},{"$f":"C39-C28","v":0.10800000000745058},{"$f":"D39-D28","v":0.19899999996414408},0.22641775545954576,{"$f":"H40*100/E40","v":1.8739791551640408},{"$f":"IF(G40>0,2,0)","v":2},{"$f":"IF(H40>0,1,0)","v":1},3,{"$f":"IF(L40=3,(ATAN(G40/F40)*180/PI()),IF(L40=1,(90+ATAN(ABS(F40)/ABS(G40))*180/PI()),IF(L40=0,(180+ATAN(ABS(G40)/ABS(F40))*180/PI()),IF(L40=2,(270+ATAN(ABS(F40)/ABS(G40))*180/PI()),\"ERROR\"))))","v":61.510715571098572},{"$f":"AVERAGE(N29:N39)","v":48.103033034919264},null,"26-A",25.389656617486366,160.38965595047571,3.6649484883993182,173.04529340605481,2.191064976820158,133.82460317257218,38.045294106416009,43.824605307006237,19.610344049524286,56.041202534400725,102.98223716286194,null,62.74371807043741,69.000809615637976,2.191064976820158,173.04529340605481]
["26-A","2003-08-21",7148339.2999999998,513540.5,null,null,null,null,null,null,null,null,null,null,null,"BH-14",70.389655950475714,143.30041137027004,155.62601436555124,8.3004114814384735,30.584084672322298,179.38548478673573,19.610344049524286,115.38965645073372,43.82460437319132,5.7093429698007867,79.851978086392052,null,62.397547161194588,77.451998959675976,5.7093429698007867,179.38548478673573]
["26-A","2004-07-28",7148339.3200000003,513540.52,{"$f":"(B42-B41)/365","v":0.93698630136986305},{"$f":"C42-C41","v":2.0000000484287739E-2},{"$f":"D42-D41","v":2.0000000018626451E-2},{"$f":"(F42^2+G42^2)^0.5","v":2.8284271603075936E-2},{"$f":"H42/E42*100","v":3.0186430219657066},{"$f":"IF(F42>0,2,0)","v":2},{"$f":"IF(G42>0,1,0)","v":1},{"$f":"SUM(J42:K42)","v":3},{"$f":"IF(L42=3,(ATAN(G42/F42)*180/PI()),IF(L42=1,(90+ATAN(ABS(F42)/ABS(G42))*180/PI()),IF(L42=0,(180+ATAN(ABS(G42)/ABS(F42))*180/PI()),IF(L42=2,(270+ATAN(ABS(F42)/ABS(G42))*180/PI()),\"ERROR\"))))","v":44.999999332989347},{"$f":"IF(AND(ABS($M$14-M42)>0,ABS($M$14-M42)<180),ABS($M$14-M42),ABS(360-MAX($M$14,M42)+MIN($M$14,M42)))","v":25.389656617486366},null,1483,19.610344049524286,115.38965661748639,1.1753940259830955,88.824605173604112,41.411753098869113,160.38965595047571,1.1753955934581484,64.610343382513605,25.389655283465039,48.220803927913281,51.954707335994534,null,49.130311755969224,56.19566494902611,1.1753940259830955,160.38965595047571]
["26-A","2004-09-23",7148339.3200000003,513540.49,{"$f":"(B43-B42)/365","v":0.15616438356164383},{"$f":"C43-C42","v":0},{"$f":"D43-D42","v":-3.0000000027939677E-2},{"$f":"(F43^2+G43^2)^0.5","v":3.0000000027939677E-2},{"$f":"H43/E43*100","v":19.210526333680672},{"$f":"IF(F43>0,2,0)","v":0},{"$f":"IF(G43>0,1,0)","v":0},0,270,{"$f":"IF(AND(ABS($M$14-M43)>0,ABS($M$14-M43)<180),ABS($M$14-M43),ABS(360-MAX($M$14,M43)+MIN($M$14,M43)))","v":160.38965595047571},null,1495,11.35341270815578,104.07972319425866,19.610344049524286,25.389655283465039,2.1910659198352391,14.079722912061861,25.389655283465039,46.175394692993748,14.079724143466152,49.568762970005146,116.73535998795799,null,38.143209285596143,38.968438285926261,2.1910659198352391,116.73535998795799]
["26-A","2005-09-17",7148339.3399999999,513540.56,0.98356164383561639,1.9999999552965164E-2,7.0000000006984919E-2,7.280109877671144E-2,7.4017830232589636,2,1,3,{"$f":"IF(L44=3,(ATAN(G44/F44)*180/PI()),IF(L44=1,(90+ATAN(ABS(F44)/ABS(G44))*180/PI()),IF(L44=0,(180+ATAN(ABS(G44)/ABS(F44))*180/PI()),IF(L44=2,(270+ATAN(ABS(F44)/ABS(G44))*180/PI()),\"ERROR\"))))","v":74.054604438875032},3.6649484883993182,null,"stddev",{"$f":"_xlfn.STDEV.S(Q37:Q43)","v":21.570726088473759},{"$f":"_xlfn.STDEV.S(R37:R43)","v":36.913854673639563},{"$f":"_xlfn.STDEV.S(S37:S43)","v":54.108861935880284},{"$f":"_xlfn.STDEV.S(T37:T43)","v":62.220076047621689},{"$f":"_xlfn.STDEV.S(U37:U43)","v":15.692831247314304},{"$f":"_xlfn.STDEV.S(V37:V43)","v":70.975058817634078},{"$f":"_xlfn.STDEV.S(W37:W43)","v":15.209746323648559},{"$f":"_xlfn.STDEV.S(X37:X43)","v":37.738069831300415},{"$f":"_xlfn.STDEV.S(Y37:Y43)","v":10.463082098361074},{"$f":"_xlfn.STDEV.S(Z37:Z43)","v":18.164315051864367},{"$f":"_xlfn.STDEV.S(AA37:AA43)","v":24.920027740750093}]
["26-A","2006-07-28",7148339.3300000001,513540.54,0.86027397260273974,-9.9999997764825821E-3,-2.0000000018626451E-2,2.2360679691697874E-2,2.5992509832706125,0,0,0,243.43494935653052,173.04529340605481,null,"mean",{"$f":"AVERAGE(Q37:Q43)","v":27.597779750658088},{"$f":"AVERAGE(R37:R43)","v":123.36415758328091},43.191811854977878,50.806396398988802,17.943399450584113,85.783303536966045,20.435960168776624,50.806396323369825,24.756283484920875,36.351174370028446,88.857978248556819]
["26-A","2008-07-09",7148339.3499999996,513540.59,1.9506849315068493,1.9999999552965164E-2,5.0000000046566129E-2,5.3851647948556035E-2,2.7606533007335607,2,1,3,68.198590973655556,2.191064976820158,null,"min",{"$f":"MIN(Q37:Q43)","v":4.3521449388067026},{"$f":"MIN(R37:R43)","v":70.389655950475714},1.1753940259830955,1.1753955934581484,2.191064976820158,10.148022048812791,1.1753955934581484,6.9547066606462309,14.079724092157647,5.7093429698007867,51.954707335994534]
["26-A","2010-07-20",7148339.3600000003,513540.57,2.0301369863013701,1.0000000707805157E-2,-2.0000000018626451E-2,2.2360680108198E-2,1.101437009378174,2,0,2,296.56505277790353,133.82460317257218,null,"max",{"$f":"MAX(Q37:Q43)","v":70.389655950475714},{"$f":"MAX(R37:R43)","v":173.04529340605481},155.62601436555124,173.04529340605481,41.411753098869113,179.38548478673573,38.045294106416009,115.38965645073372,43.82460437319132,56.041202534400725,116.73535998795799]
["26-A","2010-09-25",7148339.3499999996,513540.6,0.18356164383561643,-1.0000000707805157E-2,2.9999999969732016E-2,3.1622776796796717E-2,17.227333628105676,0,1,1,108.43495005689172,38.045294106416009]
["26-A","2011-08-11",7148339.3700000001,513540.61,0.87671232876712324,2.0000000484287739E-2,1.0000000009313226E-2,2.2360680212323021E-2,2.5505150867180948,2,1,3,26.565050643469473,43.824605307006237]
["26-A","2012-08-06",7148339.3700000001,513540.63,0.989041095890411,0,2.0000000018626451E-2,2.0000000018626451E-2,2.0221606667032281,0,1,1,90,19.610344049524286]
["26-A","2014-09-13",7148339.3389999997,513540.67200000002,2.1041095890410957,-3.1000000424683094E-2,4.2000000015832484E-2,5.2201532809490192E-2,2.4809322233676983,0,1,1,126.43085848487644,56.041202534400725]
["26-A","2015-09-17",7148339.4000000004,513540.63299999997,1.010958904109589,6.1000000685453415E-2,-3.9000000047963113E-2,7.2401658042937383E-2,7.161681622133373,2,0,2,327.40741878761378,102.98223716286194]
[null,null,null,"Totals",{"$f":"SUM(E42:E52)","v":12.082191780821919},{"$f":"C52-C41","v":0.10000000055879354},{"$f":"D52-D41","v":0.13299999997252598},0.16640012050611808,{"$f":"H53*100/E53","v":1.3772345574769409},{"$f":"IF(G53>0,2,0)","v":2},{"$f":"IF(H53>0,1,0)","v":1},3,{"$f":"IF(L53=3,(ATAN(G53/F53)*180/PI()),IF(L53=1,(90+ATAN(ABS(F53)/ABS(G53))*180/PI()),IF(L53=0,(180+ATAN(ABS(G53)/ABS(F53))*180/PI()),IF(L53=2,(270+ATAN(ABS(F53)/ABS(G53))*180/PI()),\"ERROR\"))))","v":53.061237108238515},{"$f":"AVERAGE(N42:N52)","v":69.000809615637976}]
["BH-14 (T7)","2003-08-21",7148488.3600000003,513563.01]
["BH-14","2004-07-28",7148488.3600000003,513563.01,{"$f":"(B55-B54)/365","v":0.93698630136986305},{"$f":"C55-C54","v":0},{"$f":"D55-D54","v":0},{"$f":"(F55^2+G55^2)^0.5","v":0},{"$f":"H55/E55*100","v":0},{"$f":"IF(F55>0,2,0)","v":0},{"$f":"IF(G55>0,1,0)","v":0},{"$f":"SUM(J55:K55)","v":0},0,{"$f":"IF(AND(ABS($M$14-M55)>0,ABS($M$14-M55)<180),ABS($M$14-M55),ABS(360-MAX($M$14,M55)+MIN($M$14,M55)))","v":70.389655950475714}]
["BH-14","2004-09-23",7148488.3300000001,513562.99,{"$f":"(B56-B55)/365","v":0.15616438356164383},{"$f":"C56-C55","v":-3.0000000260770321E-2},{"$f":"D56-D55","v":-2.0000000018626451E-2},{"$f":"(F56^2+G56^2)^0.5","v":3.6055512981946009E-2},{"$f":"H56/E56*100","v":23.088179365632094},{"$f":"IF(F56>0,2,0)","v":0},{"$f":"IF(G56>0,1,0)","v":0},0,{"$f":"IF(L56=3,(ATAN(G56/F56)*180/PI()),IF(L56=1,(90+ATAN(ABS(F56)/ABS(G56))*180/PI()),IF(L56=0,(180+ATAN(ABS(G56)/ABS(F56))*180/PI()),IF(L56=2,(270+ATAN(ABS(F56)/ABS(G56))*180/PI()),\"ERROR\"))))","v":213.69006732074575},{"$f":"IF(AND(ABS($M$14-M56)>0,ABS($M$14-M56)<180),ABS($M$14-M56),ABS(360-MAX($M$14,M56)+MIN($M$14,M56)))","v":143.30041137027004}]
["BH-14","2005-09-17",7148488.3399999999,513562.87,0.98356164383561639,9.9999997764825821E-3,-0.11999999999534339,0.12041594576472031,12.242846853516133,2,0,2,274.76364158492447,155.62601436555124]
["BH-14","2006-07-28",7148488.3700000001,513563.02,0.86027397260273974,3.0000000260770321E-2,0.15000000002328306,0.15297058548175574,17.781612643579887,2,1,3,78.690067431914187,8.3004114814384735]
["BH-14","2008-07-09",7148488.4299999997,513563.07,1.9506849315068493,5.9999999590218067E-2,4.9999999988358468E-2,7.8102496436810609E-2,4.0038498875612181,2,1,3,39.805571278153415,30.584084672322298]
["BH-14","2010-07-20",7148488.3600000003,513562.88,2.0301369863013701,-6.9999999366700649E-2,-0.19000000000232831,0.20248456709641563,9.9739361660177739,0,0,0,249.77514073721144,179.38548478673573]
["BH-14","2010-09-25",7148488.3600000003,513562.91,0.18356164383561643,0,2.9999999969732016E-2,2.9999999969732016E-2,16.343283565600277,0,1,1,90,19.610344049524286]
["BH-14","2011-08-11",7148488.3700000001,513562.9,0.87671232876712324,9.9999997764825821E-3,-9.9999999511055648E-3,1.4142135431106682E-2,1.6130873226106062,2,0,2,314.99999949974199,115.38965645073372]
["BH-14","2012-08-06",7148488.3899999997,513562.91,0.989041095890411,1.9999999552965164E-2,9.9999999511055648E-3,2.2360679353291529E-2,2.2608443113438801,2,1,3,26.565051577284397,43.82460437319132]
["BH-14","2014-09-13",7148488.4780000001,513563.09600000002,2.1041095890410957,8.8000000454485416E-2,0.18600000004516914,0.20576685859679239,9.7792842952902639,2,1,3,64.680312980674927,5.7093429698007867]
["BH-14","2015-09-17",7148488.5080000004,513563.09100000001,1.010958904109589,3.0000000260770321E-2,-5.0000000046566129E-3,3.04138129094789E-2,3.0084123880649862,2,0,2,350.53767786408366,79.851978086392052]
[null,null,null,"Totals",{"$f":"SUM(E55:E65)","v":12.082191780821919},{"$f":"C65-C54","v":0.14800000004470348},{"$f":"D65-D54","v":8.1000000005587935E-2},0.16871573730431158,{"$f":"H66*100/E66","v":1.3964000933350051},{"$f":"IF(G66>0,2,0)","v":2},{"$f":"IF(H66>0,1,0)","v":1},3,{"$f":"IF(L66=3,(ATAN(G66/F66)*180/PI()),IF(L66=1,(90+ATAN(ABS(F66)/ABS(G66))*180/PI()),IF(L66=0,(180+ATAN(ABS(G66)/ABS(F66))*180/PI()),IF(L66=2,(270+ATAN(ABS(F66)/ABS(G66))*180/PI()),\"ERROR\"))))","v":28.691768658994565},{"$f":"AVERAGE(N55:N65)","v":77.451998959675976}]
[1483,"2003-08-21",7148233.0099999998,513412.67]
[1483,"2004-07-28",7148233.0099999998,513412.69,{"$f":"(B68-B67)/365","v":0.93698630136986305},{"$f":"C68-C67","v":0},{"$f":"D68-D67","v":2.0000000018626451E-2},{"$f":"(F68^2+G68^2)^0.5","v":2.0000000018626451E-2},{"$f":"H68/E68*100","v":2.1345029259645187},{"$f":"IF(F68>0,2,0)","v":0},{"$f":"IF(G68>0,1,0)","v":1},{"$f":"SUM(J68:K68)","v":1},{"$f":"IF(L68=3,(ATAN(G68/F68)*180/PI()),IF(L68=1,(90+ATAN(ABS(F68)/ABS(G68))*180/PI()),IF(L68=0,(180+ATAN(ABS(G68)/ABS(F68))*180/PI()),IF(L68=2,(270+ATAN(ABS(F68)/ABS(G68))*180/PI()),\"ERROR\"))))","v":90},{"$f":"IF(AND(ABS($M$14-M68)>0,ABS($M$14-M68)<180),ABS($M$14-M68),ABS(360-MAX($M$14,M68)+MIN($M$14,M68)))","v":19.610344049524286}]
[1483,"2004-09-23",7148233.0199999996,513412.68,{"$f":"(B69-B68)/365","v":0.15616438356164383},{"$f":"C69-C68","v":9.9999997764825821E-3},{"$f":"D69-D68","v":-1.0000000009313226E-2},{"$f":"(F69^2+G69^2)^0.5","v":1.4142135472265715E-2},{"$f":"H69/E69*100","v":9.0559288550473429},{"$f":"IF(F69>0,2,0)","v":2},{"$f":"IF(G69>0,1,0)","v":0},2,{"$f":"IF(L69=3,(ATAN(G69/F69)*180/PI()),IF(L69=1,(90+ATAN(ABS(F69)/ABS(G69))*180/PI()),IF(L69=0,(180+ATAN(ABS(G69)/ABS(F69))*180/PI()),IF(L69=2,(270+ATAN(ABS(F69)/ABS(G69))*180/PI()),\"ERROR\"))))","v":314.99999933298932},{"$f":"IF(AND(ABS($M$14-M69)>0,ABS($M$14-M69)<180),ABS($M$14-M69),ABS(360-MAX($M$14,M69)+MIN($M$14,M69)))","v":115.38965661748639}]
[1483,"2005-09-17",7148233.0300000003,513412.71,0.98356164383561639,1.0000000707805157E-2,3.0000000027939677E-2,3.1622776852017351E-2,3.2151291228374186,2,1,3,71.565049976458809,1.1753940259830955]
[1483,"2006-07-28",7148233.0599999996,513412.7,0.86027397260273974,2.9999999329447746E-2,-1.0000000009313226E-2,3.1622775968487171E-2,3.675895932642617,2,0,2,341.5650507768716,88.824605173604112]
[1483,"2008-07-09",7148233.04,513412.75,1.9506849315068493,-1.9999999552965164E-2,4.9999999988358468E-2,5.3851647894511578E-2,2.7606532979630236,0,1,1,111.80140904934483,41.411753098869113]
[1483,"2010-07-20",7148233.04,513412.71,2.0301369863013701,0,-3.9999999979045242E-2,3.9999999979045242E-2,1.9703103903308383,0,0,0,270,160.38965595047571]
[1483,"2010-09-25",7148233.0499999998,513412.74,0.18356164383561643,9.9999997764825821E-3,2.9999999969732016E-2,3.1622776502286648E-2,17.227333467663623,2,1,3,71.565051543933862,1.1753955934581484]
[1483,"2011-08-11",7148233.04,513412.75,0.87671232876712324,-9.9999997764825821E-3,1.0000000009313226E-2,1.4142135472265715E-2,1.6130873273053081,0,1,1,134.99999933298932,64.610343382513605]
[1483,"2012-08-06",7148233.0599999996,513412.77,0.989041095890411,1.9999999552965164E-2,2.0000000018626451E-2,2.8284270944531429E-2,2.859767006857056,2,1,3,45.000000667010674,25.389655283465039]
[1483,"2014-09-13",7148233.0539999995,513412.78100000002,2.1041095890410957,-6.0000000521540642E-3,1.0999999998603016E-2,1.2529964109889347E-2,0.59549959636843908,0,1,1,118.61045987838899,48.220803927913281]
[1483,"2015-09-17",7148233.0779999997,513412.78899999999,1.010958904109589,2.4000000208616257E-2,7.999999972525984E-3,2.5298221470569746E-2,2.5023986007474139,2,1,3,18.434948614481179,51.954707335994534]
[null,null,null,"Totals",{"$f":"SUM(E68:E78)","v":12.082191780821919},{"$f":"C78-C67","v":6.7999999970197678E-2},{"$f":"D78-D67","v":0.1190000000060536},0.13705838171154525,{"$f":"H79*100/E79","v":1.1343834313994108},{"$f":"IF(G79>0,2,0)","v":2},{"$f":"IF(H79>0,1,0)","v":1},3,{"$f":"IF(L79=3,(ATAN(G79/F79)*180/PI()),IF(L79=1,(90+ATAN(ABS(F79)/ABS(G79))*180/PI()),IF(L79=0,(180+ATAN(ABS(G79)/ABS(F79))*180/PI()),IF(L79=2,(270+ATAN(ABS(F79)/ABS(G79))*180/PI()),\"ERROR\"))))","v":60.255118715130365},{"$f":"AVERAGE(N68:N78)","v":56.19566494902611}]
[1495,"2003-08-21",7148526.5899999999,513528.92]
[1495,"2004-07-28",7148526.6200000001,513528.97,{"$f":"(B81-B80)/365","v":0.93698630136986305},{"$f":"C81-C80","v":3.0000000260770321E-2},{"$f":"D81-D80","v":4.9999999988358468E-2},{"$f":"(F81^2+G81^2)^0.5","v":5.8309519072635693E-2},{"$f":"H81/E81*100","v":6.2230919478105342},{"$f":"IF(F81>0,2,0)","v":2},{"$f":"IF(G81>0,1,0)","v":1},{"$f":"SUM(J81:K81)","v":3},{"$f":"IF(L81=3,(ATAN(G81/F81)*180/PI()),IF(L81=1,(90+ATAN(ABS(F81)/ABS(G81))*180/PI()),IF(L81=0,(180+ATAN(ABS(G81)/ABS(F81))*180/PI()),IF(L81=2,(270+ATAN(ABS(F81)/ABS(G81))*180/PI()),\"ERROR\"))))","v":59.036243242319934},{"$f":"IF(AND(ABS($M$14-M81)>0,ABS($M$14-M81)<180),ABS($M$14-M81),ABS(360-MAX($M$14,M81)+MIN($M$14,M81)))","v":11.35341270815578}]
[1495,"2004-09-23",7148526.6500000004,513528.95,{"$f":"(B82-B81)/365","v":0.15616438356164383},{"$f":"C82-C81","v":3.0000000260770321E-2},{"$f":"D82-D81","v":-1.9999999960418791E-2},{"$f":"(F82^2+G82^2)^0.5","v":3.6055512949658211E-2},{"$f":"H82/E82*100","v":23.088179344956576},{"$f":"IF(F82>0,2,0)","v":2},{"$f":"IF(G82>0,1,0)","v":0},2,{"$f":"IF(L82=3,(ATAN(G82/F82)*180/PI()),IF(L82=1,(90+ATAN(ABS(F82)/ABS(G82))*180/PI()),IF(L82=0,(180+ATAN(ABS(G82)/ABS(F82))*180/PI()),IF(L82=2,(270+ATAN(ABS(F82)/ABS(G82))*180/PI()),\"ERROR\"))))","v":326.30993275621705},{"$f":"IF(AND(ABS($M$14-M82)>0,ABS($M$14-M82)<180),ABS($M$14-M82),ABS(360-MAX($M$14,M82)+MIN($M$14,M82)))","v":104.07972319425866}]
[1495,"2005-09-17",7148526.6500000004,513529,0.98356164383561639,0,4.9999999988358468E-2,4.9999999988358468E-2,5.0835654584264178,0,1,1,90,19.610344049524286]
[1495,"2006-07-28",7148526.6699999999,513529.02,0.86027397260273974,1.9999999552965164E-2,2.0000000018626451E-2,2.8284270944531429E-2,3.2878213040617741,2,1,3,45.000000667010674,25.389655283465039]
[1495,"2008-07-09",7148526.6900000004,513529.07,1.9506849315068493,2.0000000484287739E-2,4.9999999988358468E-2,5.3851648240396101E-2,2.760653315694463,2,1,3,68.198590030640474,2.1910659198352391]
[1495,"2010-07-20",7148526.71,513529.1,2.0301369863013701,1.9999999552965164E-2,2.9999999969732016E-2,3.60555124814851E-2,1.7760137727047314,2,1,3,56.309933038413853,14.079722912061861]
[1495,"2010-09-25",7148526.7199999997,513529.11,0.18356164383561643,9.9999997764825821E-3,1.0000000009313226E-2,1.4142135472265715E-2,7.7042976826522187,2,1,3,45.000000667010674,25.389655283465039]
[1495,"2011-08-11",7148526.71,513529.13,0.87671232876712324,-9.9999997764825821E-3,2.0000000018626451E-2,2.2360679691697874E-2,2.5505150273342889,0,1,1,116.56505064346946,46.175394692993748]
[1495,"2012-08-06",7148526.7300000004,513529.16,0.989041095890411,2.0000000484287739E-2,2.9999999969732016E-2,3.6055512998089914E-2,3.6455020067320829,2,1,3,56.309931807009562,14.079724143466152]
[1495,"2014-09-13",7148526.801,513529.18699999998,2.1041095890410957,7.0999999530613422E-2,2.7000000001862645E-2,7.5960515621260022E-2,3.6101026304374879,2,1,3,20.820892980470568,49.568762970005146]
[1495,"2015-09-17",7148526.7929999996,513529.18599999999,1.010958904109589,-8.0000003799796104E-3,-9.9999998928979039E-4,8.0622581240154725E-3,0.7974862371993624,0,0,0,187.12501593843371,116.73535998795799]
[null,null,null,"Totals",{"$f":"SUM(E81:E91)","v":12.082191780821919},{"$f":"C91-C80","v":0.20299999974668026},{"$f":"D91-D80","v":0.26600000000325963},0.33461171512498827,{"$f":"H92*100/E92","v":2.7694620412839166},{"$f":"IF(G92>0,2,0)","v":2},{"$f":"IF(H92>0,1,0)","v":1},3,{"$f":"IF(L92=3,(ATAN(G92/F92)*180/PI()),IF(L92=1,(90+ATAN(ABS(F92)/ABS(G92))*180/PI()),IF(L92=0,(180+ATAN(ABS(G92)/ABS(F92))*180/PI()),IF(L92=2,(270+ATAN(ABS(F92)/ABS(G92))*180/PI()),\"ERROR\"))))","v":52.650650990179919},{"$f":"AVERAGE(N81:N91)","v":38.968438285926261}]

{"sheet":"Clinton Movement Nov. 2","index":9,"n_rows":125,"n_cols":41,"rows_kept":125,"cut":false,"hidden":false,"merged":[]}
[]
["Monitor","Date","Northing\n(m)","Easting\n(m)","dt\n(years)","dN\n(cm)","dE\n(cm)","Movement\n(cm)","Movement Rate\n(cm/yr)","θ","Projected Movement\n(cm)","Projected Movement Rate\n(cm/yr)",null,"Movement Rates (cm)"]
["81-1","2001-06-19",{"$f":"IFERROR(VLOOKUP(CONCATENATE(A3,B3),'[2]Raw Clinton'!C:F,2,FALSE),\"N/A\")","v":7147034.71},{"$f":"IFERROR(VLOOKUP(CONCATENATE(A3,B3),'[2]Raw Clinton'!C:F,3,FALSE),\"N/A\")","v":512978.88},{"$f":"IF(A3=A2,(B3-B2)/365,\"\")","v":""},{"$f":"IFERROR(IF($A3=$A2,(C3-C2)*100,\"\"),\"\")","v":""},{"$f":"IFERROR(IF($A3=$A2,(D3-D2)*100,\"\"),\"\")","v":""},{"$f":"IFERROR(SQRT(F3^2+G3^2),\"\")","v":""},{"$f":"IFERROR(SQRT(F3^2+G3^2)/E3,\"\")","v":""},null,null,null,null,"Date","Avg. Date","dt","81-1",223,225,1195,1834,"BH-4",2836,186,300,"BH-4 Cable","Mean","Std.Dev","95%ile","5%ile",null,null,"mean","90% C.I.","90% C.I.",null,"Lookup Tables"]
["81-1","2003-08-20",{"$f":"IFERROR(VLOOKUP(CONCATENATE(A4,B4),'[2]Raw Clinton'!C:F,2,FALSE),\"N/A\")","v":7147034.8200000003},{"$f":"IFERROR(VLOOKUP(CONCATENATE(A4,B4),'[2]Raw Clinton'!C:F,3,FALSE),\"N/A\")","v":512978.93},2.1698630136986301,{"$f":"IFERROR(IF($A4=$A3,(C4-C3)*100,\"\"),\"\")","v":11.000000033527613},{"$f":"IFERROR(IF($A4=$A3,(D4-D3)*100,\"\"),\"\")","v":4.9999999988358468},{"$f":"IFERROR(SQRT(F4^2+G4^2),\"\")","v":12.083046003635257},{"$f":"IFERROR(SQRT(F4^2+G4^2)/E4,\"\")","v":5.5685754940995817},{"$f":"IFERROR(DEGREES(IF(G4=0,IF(F4>0,PI()/2,3*PI()/2),IF(G4>0,ATAN(F4/G4),PI()+ATAN(F4/G4)))),\"\")","v":65.556045290396241},{"$f":"IFERROR((F4*SIN(RADIANS($J$14))+G4*COS(RADIANS($J$14))),\"\")","v":10.530761520439121},{"$f":"IFERROR(K4/E4,\"\")","v":4.8531918623235848},null,"2003-08-20",null,null,null,null,null,null,null,null,null,null,null,null,null,null,null,null,null,"2003-08-20",{"$f":"AA5","v":0.78368195700167376},{"$f":"AC5","v":3.1661084063807738},{"$f":"AD5","v":-1.5987444923774261},null,"81-1",0,null,"2001-06-19",0]
["81-1","2004-07-28",{"$f":"IFERROR(VLOOKUP(CONCATENATE(A5,B5),'[2]Raw Clinton'!C:F,2,FALSE),\"N/A\")","v":7147034.7599999998},{"$f":"IFERROR(VLOOKUP(CONCATENATE(A5,B5),'[2]Raw Clinton'!C:F,3,FALSE),\"N/A\")","v":512978.92},0.9397260273972603,{"$f":"IFERROR(IF($A5=$A4,(C5-C4)*100,\"\"),\"\")","v":-6.0000000521540642},-1.0000000009313226,{"$f":"IFERROR(SQRT(F5^2+G5^2),\"\")","v":6.0827625818957802},{"$f":"IFERROR(SQRT(F5^2+G5^2)/E5,\"\")","v":6.4729106192185411},{"$f":"IFERROR(DEGREES(IF(G5=0,IF(F5>0,PI()/2,3*PI()/2),IF(G5>0,ATAN(F5/G5),PI()+ATAN(F5/G5)))),\"\")","v":260.53767786408366},{"$f":"IFERROR((F5*SIN(RADIANS($J$14))+G5*COS(RADIANS($J$14))),\"\")","v":-4.3500902769125931},{"$f":"IFERROR(K5/E5,\"\")","v":-4.6291048136241875},null,"2004-07-28",{"$f":"AVERAGE(N4:N5)","v":"2004-02-07T12:00:00"},{"$f":"(N5-N4)/365","v":0.9397260273972603},{"$f":"INDIRECT(\"L\"&TEXT(3+VLOOKUP(Q$3,$AK$4:$AL$13,2,FALSE)*12+VLOOKUP($N5,$AN$4:$AO$14,2,FALSE)*1,0))","v":-4.6291048136241875},{"$f":"INDIRECT(\"L\"&TEXT(3+VLOOKUP(R$3,$AK$4:$AL$13,2,FALSE)*12+VLOOKUP($N5,$AN$4:$AO$14,2,FALSE)*1,0))","v":3.0357772781164565},0.91153887156657565,1.082535847339134,3.51766260161039,"","","","","",{"$f":"AVERAGE(Q5:Z5)","v":0.78368195700167376},{"$f":"_xlfn.STDEV.S(Q5:Z5)","v":3.2384604815836653},{"$f":"AA5+1.645*AB5/SQRT(COUNT(Q5:Z5))","v":3.1661084063807738},{"$f":"AA5-1.645*AB5/SQRT(COUNT(Q5:Z5))","v":-1.5987444923774261},null,"2004-07-28",{"$f":"AA5","v":0.78368195700167376},{"$f":"AC5","v":3.1661084063807738},{"$f":"AD5","v":-1.5987444923774261},null,223,1,null,"2003-08-20",1]
["81-1","2006-07-28",{"$f":"IFERROR(VLOOKUP(CONCATENATE(A6,B6),'[2]Raw Clinton'!C:F,2,FALSE),\"N/A\")","v":7147034.7999999998},{"$f":"IFERROR(VLOOKUP(CONCATENATE(A6,B6),'[2]Raw Clinton'!C:F,3,FALSE),\"N/A\")","v":512978.92},2,4.0000000037252903,0,4.0000000037252903,2.0000000018626451,90,2.3620399443550251,1.1810199721775125,null,"2006-07-28","2005-07-28",2,{"$f":"INDIRECT(\"L\"&TEXT(3+VLOOKUP(Q$3,$AK$4:$AL$13,2,FALSE)*12+VLOOKUP($N6,$AN$4:$AO$14,2,FALSE)*1,0))","v":1.1810199721775125},1.9845557553329252,1.9987256640110243,1.7439208238519015E-2,2.6791052507523667,"","","","","",{"$f":"AVERAGE(Q6:Z6)","v":1.5721691701024696},{"$f":"_xlfn.STDEV.S(Q6:Z6)","v":1.0182710314760219},{"$f":"AA6+1.645*AB6/SQRT(COUNT(Q6:Z6))","v":2.3212769180033108},{"$f":"AA6-1.645*AB6/SQRT(COUNT(Q6:Z6))","v":0.82306142220162848},null,"2004-07-28",{"$f":"AA6","v":1.5721691701024696},{"$f":"AC6","v":2.3212769180033108},{"$f":"AD6","v":0.82306142220162848},null,225,2,null,"2004-07-28",2]
["81-1","2008-07-09",{"$f":"IFERROR(VLOOKUP(CONCATENATE(A7,B7),'[2]Raw Clinton'!C:F,2,FALSE),\"N/A\")","v":7147034.8300000001},{"$f":"IFERROR(VLOOKUP(CONCATENATE(A7,B7),'[2]Raw Clinton'!C:F,3,FALSE),\"N/A\")","v":512978.93},1.9506849315068493,3.0000000260770321,1.0000000009313226,3.162277685201734,1.6211114537902147,71.565051310480129,2.5785603048974419,1.3218743136061324,null,"2008-07-09","2007-07-19",1.9506849315068493,1.3218743136061324,2.1618975527529298,2.0858491377678705,4.0826198356800534,2.1793399873592376,"","","","","",2.3663161654332447,1.0237145457029839,3.1194285236560693,1.6132038072104202,null,"2006-07-28",{"$f":"AA6","v":1.5721691701024696},{"$f":"AC6","v":2.3212769180033108},{"$f":"AD6","v":0.82306142220162848},null,1195,3,null,"2006-07-28",3]
["81-1","2010-07-20",{"$f":"IFERROR(VLOOKUP(CONCATENATE(A8,B8),'[2]Raw Clinton'!C:F,2,FALSE),\"N/A\")","v":7147034.8399999999},{"$f":"IFERROR(VLOOKUP(CONCATENATE(A8,B8),'[2]Raw Clinton'!C:F,3,FALSE),\"N/A\")","v":512978.93},2.0301369863013701,0.99999997764825821,0,0.99999997764825821,0.49257758683078839,90,0.59050997233987423,0.29087198367618633,null,"2010-07-20","2009-07-14T12:00:00",2.0301369863013701,0.29087198367618633,1.4663215714945612,0.96694668372484316,0.98500535662689193,2.9119772800103174,"","","","","",1.32422457510656,0.98128550335563425,2.0461233139923594,0.60232583622076064,null,"2006-07-28",{"$f":"AA7","v":2.3663161654332447},{"$f":"AC7","v":3.1194285236560693},{"$f":"AD7","v":1.6132038072104202},null,1834,4,null,"2008-07-09",4]
["81-1","2010-09-25",{"$f":"IFERROR(VLOOKUP(CONCATENATE(A9,B9),'[2]Raw Clinton'!C:F,2,FALSE),\"N/A\")","v":7147034.8300000001},{"$f":"IFERROR(VLOOKUP(CONCATENATE(A9,B9),'[2]Raw Clinton'!C:F,3,FALSE),\"N/A\")","v":512978.94},0.18356164383561643,-0.99999997764825821,1.0000000009313226,1.4142135472265713,7.7042976826522169,-44.999999332989333,0.21652036054241708,1.1795512178803318,null,"2010-09-25","2010-08-22T12:00:00",0.18356164383561643,1.1795512178803318,-8.7842512434526654,6.4164847325945376,-10.893865212843687,-14.281026479001543,"","","","","",-5.2726213969646052,8.7084301383519414,1.133877744267469,-11.679120538196679,null,"2008-07-09",{"$f":"AA7","v":2.3663161654332447},{"$f":"AC7","v":3.1194285236560693},{"$f":"AD7","v":1.6132038072104202},null,"BH-4",5,null,"2010-07-20",5]
["81-1","2011-08-11",{"$f":"IFERROR(VLOOKUP(CONCATENATE(A10,B10),'[2]Raw Clinton'!C:F,2,FALSE),\"N/A\")","v":7147034.8600000003},{"$f":"IFERROR(VLOOKUP(CONCATENATE(A10,B10),'[2]Raw Clinton'!C:F,3,FALSE),\"N/A\")","v":512978.99},0.87671232876712324,3.0000000260770321,4.9999999988358468,5.8309519072635698,6.65092951922251,30.96375675768007,5.8066816317290719,6.6232462361909734,null,"2011-08-11","2011-03-04",0.87671232876712324,6.6232462361909734,5.8005618629018896,2.3205072188474047,2.261011432042086,4.849031473711741,"","","","","",4.370871644738819,2.0000841631201154,5.8422662899102891,2.8994769995673488,null,"2008-07-09",{"$f":"AA8","v":1.32422457510656},{"$f":"AC8","v":2.0461233139923594},{"$f":"AD8","v":0.60232583622076064},null,2836,6,null,"2010-09-25",6]
["81-1","2012-08-06",{"$f":"IFERROR(VLOOKUP(CONCATENATE(A11,B11),'[2]Raw Clinton'!C:F,2,FALSE),\"N/A\")","v":7147034.8600000003},{"$f":"IFERROR(VLOOKUP(CONCATENATE(A11,B11),'[2]Raw Clinton'!C:F,3,FALSE),\"N/A\")","v":512978.94},0.989041095890411,0,-4.9999999988358468,4.9999999988358468,5.0554016608728087,180,-4.0351516597139216,-4.0798624814282034,null,"2012-08-06","2012-02-07T12:00:00",0.989041095890411,-4.0798624814282034,2.6335907215800987,2.8869602945699278,1.0285589906851051,0.70731693319288991,"","","","","",0.63531289171996352,2.8042706800500823,2.6983205082595725,-1.4276947248196454,null,"2010-07-20",{"$f":"AA8","v":1.32422457510656},{"$f":"AC8","v":2.0461233139923594},{"$f":"AD8","v":0.60232583622076064},null,186,7,null,"2011-08-11",7]
["81-1","2014-09-11",{"$f":"IFERROR(VLOOKUP(CONCATENATE(A12,B12),'[2]Raw Clinton'!C:F,2,FALSE),\"N/A\")","v":7147034.8430000003},{"$f":"IFERROR(VLOOKUP(CONCATENATE(A12,B12),'[2]Raw Clinton'!C:F,3,FALSE),\"N/A\")","v":512978.96399999998},2.0986301369863014,-1.6999999992549419,2.3999999975785613,2.9410882315639388,1.4014323818809891,-35.311213455055409,0.93300582018347389,0.44457849134068922,null,"2014-09-11","2013-08-24",2.0986301369863014,0.44457849134068922,1.1525028890195192,0.46769420797109934,1.2154475587818205,1.6810055002461997,1.1519637533559084,6.6099593093396818,8.9178990846548327,0.803452465994277,-2.7884584104174852,1.965604485028654,3.3396652522984964,3.7028805658831434,0.22832840417416489,null,"2010-07-20",{"$f":"AA9","v":-5.2726213969646052},{"$f":"AC9","v":1.133877744267469},{"$f":"AD9","v":-11.679120538196679},null,300,8,null,"2012-08-06",8]
["81-1","2015-09-17",{"$f":"IFERROR(VLOOKUP(CONCATENATE(A13,B13),'[2]Raw Clinton'!C:F,2,FALSE),\"N/A\")","v":7147034.8499999996},{"$f":"IFERROR(VLOOKUP(CONCATENATE(A13,B13),'[2]Raw Clinton'!C:F,3,FALSE),\"N/A\")","v":512978.97100000002},1.0164383561643835,0.69999992847442627,0.70000000414438546,0.98994944601547286,0.97393948192896929,44.999996903164636,0.97827818347671991,0.96245697296227162,null,"2015-09-17","2015-03-15T12:00:00",1.0164383561643835,0.96245697296227162,2.4405757089330824,1.650372506160046,2.5935925065868481,1.3107036623642612,0.48650082516305687,11.741332767522925,5.3711161497837097,3.8724704973880613,9.6055646859187416,4.0034686282783003,3.829431141728632,5.995518316858834,2.0114189396977666,null,"2010-09-25",{"$f":"AA9","v":-5.2726213969646052},{"$f":"AC9","v":1.133877744267469},{"$f":"AD9","v":-11.679120538196679},null,"BH-4 Cable",9,null,"2014-09-11",9]
[null,"Totals From August 2, 2003 to September 17, 2015",null,null,null,{"$f":"IFERROR(IF($A13=$A4,(C13-C4)*100,\"\"),\"\")","v":2.9999999329447746},{"$f":"IFERROR(IF($A13=$A4,(D13-D4)*100,\"\"),\"\")","v":4.1000000026542693},5.0803542808975104,{"$f":"IFERROR(SQRT(G14^2+H14^2)/F14,\"\")","v":2.1761332053402835},{"$f":"DEGREES(IF(G14=0,IF(F14>0,PI()/2,3*PI()/2),IF(G14>0,ATAN(F14/G14),PI()+ATAN(F14/G14))))","v":36.193206677577123},{"$f":"SUM(K5:K13)","v":5.0803542808975086},null,null,null,null,"Total Movement",{"$f":"SUMPRODUCT($P$5:$P$13,Q5:Q13)","v":5.0803542808975086},24.992999079822884,19.612496062882744,17.202616012375412,26.016148830663099,2.9120439485099174,25.806200788233429,24.174780247713308,5.6222771054317446,3.9115215235508467,22.87193169485673,null,null,null,null,"2010-09-25",{"$f":"AA10","v":4.370871644738819},{"$f":"AC10","v":5.8422662899102891},{"$f":"AD10","v":2.8994769995673488},null,null,null,null,"2015-09-17",10]
[223,"2001-06-19",{"$f":"IFERROR(VLOOKUP(CONCATENATE(A15,B15),'[2]Raw Clinton'!C:F,2,FALSE),\"N/A\")","v":"N/A"},{"$f":"IFERROR(VLOOKUP(CONCATENATE(A15,B15),'[2]Raw Clinton'!C:F,3,FALSE),\"N/A\")","v":"N/A"},{"$f":"IF(A15=A13,(B15-B13)/365,\"\")","v":""},{"$f":"IFERROR(IF($A15=$A13,(C15-C13)*100,\"\"),\"\")","v":""},{"$f":"IFERROR(IF($A15=$A13,(D15-D13)*100,\"\"),\"\")","v":""},"","",null,null,null,null,null,null,"Average Movement",{"$f":"Q14/SUM($P5:$P13)","v":0.42038751134155306},{"$f":"R14/SUM($P5:$P13)","v":2.0681125967207783},1.6228884749381549,1.4234765006839776,2.1527758610727794,{"$f":"V14/SUM($P12:$P13)","v":0.9348250142534037},{"$f":"W14/SUM($P12:$P13)","v":8.2843124781927902},7.7605934832149144,1.8048646820427325,1.2556775339455226,{"$f":"AA14/SUM(Y5:Y13)","v":4.8914261150085911},null,null,null,null,"2011-08-11",{"$f":"AA10","v":4.370871644738819},{"$f":"AC10","v":5.8422662899102891},{"$f":"AD10","v":2.8994769995673488}]
[223,"2003-08-20",{"$f":"IFERROR(VLOOKUP(CONCATENATE(A16,B16),'[2]Raw Clinton'!C:F,2,FALSE),\"N/A\")","v":7146978.0499999998},{"$f":"IFERROR(VLOOKUP(CONCATENATE(A16,B16),'[2]Raw Clinton'!C:F,3,FALSE),\"N/A\")","v":512942.74},2.1698630136986301,"","","","",{"$f":"IFERROR(DEGREES(IF(G16=0,IF(F16>0,PI()/2,3*PI()/2),IF(G16>0,ATAN(F16/G16),PI()+ATAN(F16/G16)))),\"\")","v":""},{"$f":"IFERROR((F16*SIN(RADIANS($J$26))+G16*COS(RADIANS($J$26))),\"\")","v":""},{"$f":"IFERROR(K16/E16,\"\")","v":""},null,null,null,"Direction of Movement",{"$f":"J14","v":36.193206677577123},{"$f":"J26","v":82.874983664339112},{"$f":"J38","v":87.954591503829676},{"$f":"J50","v":90.999243682879381},{"$f":"J62","v":106.06640053214167},{"$f":"J74","v":-74.054604114808527},{"$f":"J86","v":14.359336396812404},{"$f":"J98","v":4.5077708694703782},{"$f":"J110","v":95.102165269239194},{"$f":"J122","v":94.398705302680966},null,null,null,null,null,"2011-08-11",{"$f":"AA11","v":0.63531289171996352},{"$f":"AC11","v":2.6983205082595725},{"$f":"AD11","v":-1.4276947248196454}]
[223,"2004-07-28",{"$f":"IFERROR(VLOOKUP(CONCATENATE(A17,B17),'[2]Raw Clinton'!C:F,2,FALSE),\"N/A\")","v":7146978.0800000001},{"$f":"IFERROR(VLOOKUP(CONCATENATE(A17,B17),'[2]Raw Clinton'!C:F,3,FALSE),\"N/A\")","v":512942.73},0.9397260273972603,3.0000000260770321,-1.0000000009313226,3.162277685201734,3.3651059915412036,{"$f":"IFERROR(DEGREES(IF(G17=0,IF(F17>0,PI()/2,3*PI()/2),IF(G17>0,ATAN(F17/G17),PI()+ATAN(F17/G17)))),\"\")","v":108.43494868951987},{"$f":"IFERROR((F17*SIN(RADIANS($J$26))+G17*COS(RADIANS($J$26))),\"\")","v":2.8527989216272456},{"$f":"IFERROR(K17/E17,\"\")","v":3.0357772781164565},null,null,null,null,null,null,null,null,null,null,null,null,null,null,null,null,null,null,null,"2012-08-06",{"$f":"AA11","v":0.63531289171996352},{"$f":"AC11","v":2.6983205082595725},{"$f":"AD11","v":-1.4276947248196454}]
[223,"2006-07-28",{"$f":"IFERROR(VLOOKUP(CONCATENATE(A18,B18),'[2]Raw Clinton'!C:F,2,FALSE),\"N/A\")","v":7146978.1200000001},{"$f":"IFERROR(VLOOKUP(CONCATENATE(A18,B18),'[2]Raw Clinton'!C:F,3,FALSE),\"N/A\")","v":512942.73},2,4.0000000037252903,0,4.0000000037252903,2.0000000018626451,90,{"$f":"IFERROR((F18*SIN(RADIANS($J$26))+G18*COS(RADIANS($J$26))),\"\")","v":3.9691115106658503},1.9845557553329252,null,null,null,null,null,null,null,null,null,null,null,null,null,null,{"$f":"SUMPRODUCT(AA5:AA8,P5:P8)/SUM(P5:P8)","v":1.6162129554112463},null,null,null,null,"2012-08-06",{"$f":"AA12","v":1.965604485028654},{"$f":"AC12","v":3.7028805658831434},{"$f":"AD12","v":0.22832840417416489}]
[223,"2008-07-09",{"$f":"IFERROR(VLOOKUP(CONCATENATE(A19,B19),'[2]Raw Clinton'!C:F,2,FALSE),\"N/A\")","v":7146978.1600000001},{"$f":"IFERROR(VLOOKUP(CONCATENATE(A19,B19),'[2]Raw Clinton'!C:F,3,FALSE),\"N/A\")","v":512942.75},1.9506849315068493,4.0000000037252903,2.0000000018626451,4.4721359591645804,2.2925977880548762,63.43494882292201,4.2171809796166739,2.1618975527529298,null,null,null,null,null,null,null,null,null,null,null,null,null,null,{"$f":"SUMPRODUCT(AA9:AA11,P9:P11)/SUM(P9:P11)","v":1.7042262655490648},null,null,null,null,"2014-09-11",{"$f":"AA12","v":1.965604485028654},{"$f":"AC12","v":3.7028805658831434},{"$f":"AD12","v":0.22832840417416489}]
[223,"2010-07-20",{"$f":"IFERROR(VLOOKUP(CONCATENATE(A20,B20),'[2]Raw Clinton'!C:F,2,FALSE),\"N/A\")","v":7146978.1900000004},{"$f":"IFERROR(VLOOKUP(CONCATENATE(A20,B20),'[2]Raw Clinton'!C:F,3,FALSE),\"N/A\")","v":512942.75},2.0301369863013701,3.0000000260770321,0,3.0000000260770321,1.4777328063672288,90,2.9768336561026576,1.4663215714945612,null,null,null,null,null,null,null,null,null,null,null,null,null,null,{"$f":"SUMPRODUCT(AA12,P12)/SUM(P12)","v":1.965604485028654},null,null,null,null,"2014-09-11",{"$f":"AA13","v":4.0034686282783003},{"$f":"AC13","v":5.995518316858834},{"$f":"AD13","v":2.0114189396977666}]
[223,"2010-09-25",{"$f":"IFERROR(VLOOKUP(CONCATENATE(A21,B21),'[2]Raw Clinton'!C:F,2,FALSE),\"N/A\")","v":7146978.1699999999},{"$f":"IFERROR(VLOOKUP(CONCATENATE(A21,B21),'[2]Raw Clinton'!C:F,3,FALSE),\"N/A\")","v":512942.78},0.18356164383561643,{"$f":"IFERROR(IF($A21=$A20,(C21-C20)*100,\"\"),\"\")","v":-2.0000000484287739},3.0000000027939677,3.6055513046521619,19.642182480567747,-33.690068141681934,-1.612451598113229,-8.7842512434526654,null,null,null,null,null,null,null,null,null,null,null,null,null,null,{"$f":"SUMPRODUCT(AA13,P13)/SUM(P13)","v":4.0034686282783003},null,null,null,null,"2015-09-17",{"$f":"AA13","v":4.0034686282783003},{"$f":"AC13","v":5.995518316858834},{"$f":"AD13","v":2.0114189396977666}]
[223,"2011-08-11",{"$f":"IFERROR(VLOOKUP(CONCATENATE(A22,B22),'[2]Raw Clinton'!C:F,2,FALSE),\"N/A\")","v":7146978.2199999997},{"$f":"IFERROR(VLOOKUP(CONCATENATE(A22,B22),'[2]Raw Clinton'!C:F,3,FALSE),\"N/A\")","v":512942.79},0.87671232876712324,4.9999999813735485,0.99999999511055648,5.0990194943691476,5.8160691107648095,78.690067538806915,5.0854240989824779,5.8005618629018896]
[223,"2012-08-06",{"$f":"IFERROR(VLOOKUP(CONCATENATE(A23,B23),'[2]Raw Clinton'!C:F,2,FALSE),\"N/A\")","v":7146978.25},{"$f":"IFERROR(VLOOKUP(CONCATENATE(A23,B23),'[2]Raw Clinton'!C:F,3,FALSE),\"N/A\")","v":512942.76},0.989041095890411,3.0000000260770321,-2.9999999969732016,4.242640703418262,4.289650572708215,134.99999972207888,2.6047294533983991,2.6335907215800987]
[223,"2014-09-11",{"$f":"IFERROR(VLOOKUP(CONCATENATE(A24,B24),'[2]Raw Clinton'!C:F,2,FALSE),\"N/A\")","v":7146978.2709999997},{"$f":"IFERROR(VLOOKUP(CONCATENATE(A24,B24),'[2]Raw Clinton'!C:F,3,FALSE),\"N/A\")","v":512942.78700000001},2.0986301369863014,2.0999999716877937,2.7000000001862645,3.4205262580624289,1.6298852274057265,37.874983274835778,2.4186772958601419,1.1525028890195192]
[223,"2015-09-17",{"$f":"IFERROR(VLOOKUP(CONCATENATE(A25,B25),'[2]Raw Clinton'!C:F,2,FALSE),\"N/A\")","v":7146978.2980000004},{"$f":"IFERROR(VLOOKUP(CONCATENATE(A25,B25),'[2]Raw Clinton'!C:F,3,FALSE),\"N/A\")","v":512942.77100000001},1.0164383561643835,2.7000000700354576,-1.6000000003259629,3.1384710257121315,3.0877140819000757,120.65066731035725,2.4806947616826673,2.4405757089330824,null,null,null,null,null,null,null,null,null,null,null,null,null,"Movement(cm)","Movement Rate (cm/y)","Azimuth (CW from N)"]
[null,"Totals From August 2, 2003 to September 17, 2015",null,null,null,{"$f":"IFERROR(IF($A25=$A16,(C25-C16)*100,\"\"),\"\")","v":24.800000060349703},{"$f":"IFERROR(IF($A25=$A16,(D25-D16)*100,\"\"),\"\")","v":3.1000000017229468},24.992999079822884,{"$f":"IFERROR(SQRT(G26^2+H26^2)/F26,\"\")","v":1.015504800521714},{"$f":"DEGREES(IF(G26=0,IF(F26>0,PI()/2,3*PI()/2),IF(G26>0,ATAN(F26/G26),PI()+ATAN(F26/G26))))","v":82.874983664339112},{"$f":"SUM(K17:K25)","v":24.992999079822884},null,null,null,null,null,null,null,null,null,null,null,null,null,"81-1",5.0803542808975086,0.42038751134155306,53.806793322422877]
[225,"2001-06-19",{"$f":"IFERROR(VLOOKUP(CONCATENATE(A27,B27),'[2]Raw Clinton'!C:F,2,FALSE),\"N/A\")","v":"N/A"},{"$f":"IFERROR(VLOOKUP(CONCATENATE(A27,B27),'[2]Raw Clinton'!C:F,3,FALSE),\"N/A\")","v":"N/A"},{"$f":"IF(A27=A25,(B27-B25)/365,\"\")","v":""},{"$f":"IFERROR(IF($A27=$A25,(C27-C25)*100,\"\"),\"\")","v":""},{"$f":"IFERROR(IF($A27=$A25,(D27-D25)*100,\"\"),\"\")","v":""},"","",null,null,null,null,null,null,null,null,null,null,null,null,null,null,null,223,24.992999079822884,2.0681125967207783,7.125016335660888]
[225,"2003-08-20",{"$f":"IFERROR(VLOOKUP(CONCATENATE(A28,B28),'[2]Raw Clinton'!C:F,2,FALSE),\"N/A\")","v":7146918.7199999997},{"$f":"IFERROR(VLOOKUP(CONCATENATE(A28,B28),'[2]Raw Clinton'!C:F,3,FALSE),\"N/A\")","v":512905.22},2.1698630136986301,"","","","",{"$f":"IFERROR(DEGREES(IF(G28=0,IF(F28>0,PI()/2,3*PI()/2),IF(G28>0,ATAN(F28/G28),PI()+ATAN(F28/G28)))),\"\")","v":""},{"$f":"IFERROR((F28*SIN(RADIANS($J$38))+G28*COS(RADIANS($J$38))),\"\")","v":""},{"$f":"IFERROR(K28/E28,\"\")","v":""},null,null,null,null,null,null,null,null,null,null,null,null,225,19.612496062882744,1.6228884749381549,2.0454084961703245]
[225,"2004-07-28",{"$f":"IFERROR(VLOOKUP(CONCATENATE(A29,B29),'[2]Raw Clinton'!C:F,2,FALSE),\"N/A\")","v":7146918.7300000004},{"$f":"IFERROR(VLOOKUP(CONCATENATE(A29,B29),'[2]Raw Clinton'!C:F,3,FALSE),\"N/A\")","v":512905.18},0.9397260273972603,1.0000000707805157,-3.9999999979045242,4.1231056407515476,4.3875613961350286,{"$f":"IFERROR(DEGREES(IF(G29=0,IF(F29>0,PI()/2,3*PI()/2),IF(G29>0,ATAN(F29/G29),PI()+ATAN(F29/G29)))),\"\")","v":165.96375557079347},{"$f":"IFERROR((F29*SIN(RADIANS($J$38))+G29*COS(RADIANS($J$38))),\"\")","v":0.85659680259543958},{"$f":"IFERROR(K29/E29,\"\")","v":0.91153887156657565},null,null,null,null,null,null,null,null,null,null,null,null,1195,17.202616012375412,1.4234765006839776,359.00075631712059]
[225,"2006-07-28",{"$f":"IFERROR(VLOOKUP(CONCATENATE(A30,B30),'[2]Raw Clinton'!C:F,2,FALSE),\"N/A\")","v":7146918.7699999996},{"$f":"IFERROR(VLOOKUP(CONCATENATE(A30,B30),'[2]Raw Clinton'!C:F,3,FALSE),\"N/A\")","v":512905.18},2,3.9999999105930328,0,3.9999999105930328,1.9999999552965164,90,{"$f":"IFERROR((F30*SIN(RADIANS($J$38))+G30*COS(RADIANS($J$38))),\"\")","v":3.9974513280220485},1.9987256640110243,null,null,null,null,null,null,null,null,null,null,null,null,1834,26.016148830663099,2.1527758610727794,343.93359946785836]
[225,"2008-07-09",{"$f":"IFERROR(VLOOKUP(CONCATENATE(A31,B31),'[2]Raw Clinton'!C:F,2,FALSE),\"N/A\")","v":7146918.8099999996},{"$f":"IFERROR(VLOOKUP(CONCATENATE(A31,B31),'[2]Raw Clinton'!C:F,3,FALSE),\"N/A\")","v":512905.2},1.9506849315068493,4.0000000037252903,2.0000000018626451,4.4721359591645804,2.2925977880548762,63.43494882292201,4.0688344824403391,2.0858491377678705,null,null,null,null,null,null,null,null,null,null,null,null,"BH-4",2.9120439485099174,0.9348250142534037,164.05460411480851]
[225,"2010-07-20",{"$f":"IFERROR(VLOOKUP(CONCATENATE(A32,B32),'[2]Raw Clinton'!C:F,2,FALSE),\"N/A\")","v":7146918.8300000001},{"$f":"IFERROR(VLOOKUP(CONCATENATE(A32,B32),'[2]Raw Clinton'!C:F,3,FALSE),\"N/A\")","v":512905.19},2.0301369863013701,2.0000000484287739,-1.0000000009313226,2.2360680212323021,1.1014370145071393,116.56505064346946,1.9630342264112572,0.96694668372484316,null,null,null,null,null,null,null,null,null,null,null,null,2836,25.806200788233429,8.2843124781927902,75.640663603187591]
[225,"2010-09-25",{"$f":"IFERROR(VLOOKUP(CONCATENATE(A33,B33),'[2]Raw Clinton'!C:F,2,FALSE),\"N/A\")","v":7146918.8399999999},{"$f":"IFERROR(VLOOKUP(CONCATENATE(A33,B33),'[2]Raw Clinton'!C:F,3,FALSE),\"N/A\")","v":512905.24},0.18356164383561643,0.99999997764825821,4.9999999988358468,5.0990195080677019,27.778240603652407,11.30993223030478,1.1778204851611891,6.4164847325945376,null,null,null,null,null,null,null,null,null,null,null,null,186,24.174780247713308,7.7605934832149144,85.492229130529623]
[225,"2011-08-11",{"$f":"IFERROR(VLOOKUP(CONCATENATE(A34,B34),'[2]Raw Clinton'!C:F,2,FALSE),\"N/A\")","v":7146918.8600000003},{"$f":"IFERROR(VLOOKUP(CONCATENATE(A34,B34),'[2]Raw Clinton'!C:F,3,FALSE),\"N/A\")","v":512905.25},0.87671232876712324,2.0000000484287739,1.0000000009313226,2.2360680212323021,2.5505150867180948,63.434949356530538,2.0344172877566287,2.3205072188474047,null,null,null,null,null,null,null,null,null,null,null,null,300,5.6222771054317446,1.8048646820427325,354.89783473076079]
[225,"2012-08-06",{"$f":"IFERROR(VLOOKUP(CONCATENATE(A35,B35),'[2]Raw Clinton'!C:F,2,FALSE),\"N/A\")","v":7146918.8899999997},{"$f":"IFERROR(VLOOKUP(CONCATENATE(A35,B35),'[2]Raw Clinton'!C:F,3,FALSE),\"N/A\")","v":512905.21},0.989041095890411,2.9999999329447746,-3.9999999979045242,4.999999958090485,5.0554016196759752,143.13010295446557,2.8553223735335451,2.8869602945699278,null,null,null,null,null,null,null,null,null,null,null,null,"BH-4 Cable",3.9115215235508467,1.2556775339455226,355.60129469731902]
[225,"2014-09-11",{"$f":"IFERROR(VLOOKUP(CONCATENATE(A36,B36),'[2]Raw Clinton'!C:F,2,FALSE),\"N/A\")","v":7146918.9000000004},{"$f":"IFERROR(VLOOKUP(CONCATENATE(A36,B36),'[2]Raw Clinton'!C:F,3,FALSE),\"N/A\")","v":512905.20500000002},2.0986301369863014,1.0000000707805157,-0.50000000046566129,1.1180340522661631,0.53274468547930753,116.56504957625251,0.98151715974208797,0.46769420797109934]
[225,"2015-09-17",{"$f":"IFERROR(VLOOKUP(CONCATENATE(A37,B37),'[2]Raw Clinton'!C:F,2,FALSE),\"N/A\")","v":7146918.9160000002},{"$f":"IFERROR(VLOOKUP(CONCATENATE(A37,B37),'[2]Raw Clinton'!C:F,3,FALSE),\"N/A\")","v":512905.22700000001},1.0164383561643835,{"$f":"IFERROR(IF($A37=$A36,(C37-C36)*100,\"\"),\"\")","v":1.5999999828636646},2.1999999997206032,2.7202940914420228,2.6763001169173544,36.027373096666565,1.677501917220211,1.650372506160046]
[null,"Totals From August 2, 2003 to September 17, 2015",null,null,null,{"$f":"IFERROR(IF($A37=$A28,(C37-C28)*100,\"\"),\"\")","v":19.6000000461936},{"$f":"IFERROR(IF($A37=$A28,(D37-D28)*100,\"\"),\"\")","v":0.70000000414438546},19.612496062882744,{"$f":"IFERROR(SQRT(G38^2+H38^2)/F38,\"\")","v":1.0012746977859499},{"$f":"DEGREES(IF(G38=0,IF(F38>0,PI()/2,3*PI()/2),IF(G38>0,ATAN(F38/G38),PI()+ATAN(F38/G38))))","v":87.954591503829676},{"$f":"SUM(K29:K37)","v":19.612496062882744}]
[1195,"2001-06-19",{"$f":"IFERROR(VLOOKUP(CONCATENATE(A39,B39),'[2]Raw Clinton'!C:F,2,FALSE),\"N/A\")","v":7147111.8300000001},{"$f":"IFERROR(VLOOKUP(CONCATENATE(A39,B39),'[2]Raw Clinton'!C:F,3,FALSE),\"N/A\")","v":512899.53},{"$f":"IF(A39=A37,(B39-B37)/365,\"\")","v":""},{"$f":"IFERROR(IF($A39=$A37,(C39-C37)*100,\"\"),\"\")","v":""},{"$f":"IFERROR(IF($A39=$A37,(D39-D37)*100,\"\"),\"\")","v":""},"",""]
[1195,"2003-08-20",{"$f":"IFERROR(VLOOKUP(CONCATENATE(A40,B40),'[2]Raw Clinton'!C:F,2,FALSE),\"N/A\")","v":7147111.9400000004},{"$f":"IFERROR(VLOOKUP(CONCATENATE(A40,B40),'[2]Raw Clinton'!C:F,3,FALSE),\"N/A\")","v":512899.53},2.1698630136986301,11.000000033527613,0,11.000000033527613,5.0694444598959327,{"$f":"IFERROR(DEGREES(IF(G40=0,IF(F40>0,PI()/2,3*PI()/2),IF(G40>0,ATAN(F40/G40),PI()+ATAN(F40/G40)))),\"\")","v":90},{"$f":"IFERROR((F40*SIN(RADIANS($J$50))+G40*COS(RADIANS($J$50))),\"\")","v":10.998327213417019},{"$f":"IFERROR(K40/E40,\"\")","v":5.0686735263853686}]
[1195,"2004-07-28",{"$f":"IFERROR(VLOOKUP(CONCATENATE(A41,B41),'[2]Raw Clinton'!C:F,2,FALSE),\"N/A\")","v":7147111.9500000002},{"$f":"IFERROR(VLOOKUP(CONCATENATE(A41,B41),'[2]Raw Clinton'!C:F,3,FALSE),\"N/A\")","v":512899.52},0.9397260273972603,0.99999997764825821,-1.0000000009313226,1.4142135472265713,1.5049211216842522,{"$f":"IFERROR(DEGREES(IF(G41=0,IF(F41>0,PI()/2,3*PI()/2),IF(G41>0,ATAN(F41/G41),PI()+ATAN(F41/G41)))),\"\")","v":135.00000066701065},{"$f":"IFERROR((F41*SIN(RADIANS($J$50))+G41*COS(RADIANS($J$50))),\"\")","v":1.0172871113351314},{"$f":"IFERROR(K41/E41,\"\")","v":1.082535847339134}]
[1195,"2006-07-28",{"$f":"IFERROR(VLOOKUP(CONCATENATE(A42,B42),'[2]Raw Clinton'!C:F,2,FALSE),\"N/A\")","v":7147111.9500000002},{"$f":"IFERROR(VLOOKUP(CONCATENATE(A42,B42),'[2]Raw Clinton'!C:F,3,FALSE),\"N/A\")","v":512899.5},2,0,-2.0000000018626451,2.0000000018626451,1.0000000009313226,180,3.4878416477038029E-2,1.7439208238519015E-2]
[1195,"2008-07-09",{"$f":"IFERROR(VLOOKUP(CONCATENATE(A43,B43),'[2]Raw Clinton'!C:F,2,FALSE),\"N/A\")","v":7147112.0300000003},{"$f":"IFERROR(VLOOKUP(CONCATENATE(A43,B43),'[2]Raw Clinton'!C:F,3,FALSE),\"N/A\")","v":512899.52},1.9506849315068493,8.0000000074505806,2.0000000018626451,8.2462112589152046,4.2273414459326544,75.963756532073532,7.963904994532049,4.0826198356800534]
[1195,"2010-07-20",{"$f":"IFERROR(VLOOKUP(CONCATENATE(A44,B44),'[2]Raw Clinton'!C:F,2,FALSE),\"N/A\")","v":7147112.0499999998},{"$f":"IFERROR(VLOOKUP(CONCATENATE(A44,B44),'[2]Raw Clinton'!C:F,3,FALSE),\"N/A\")","v":512899.52},2.0301369863013701,1.9999999552965164,0,1.9999999552965164,0.98515517366157679,90,1.9996958061932246,0.98500535662689193]
[1195,"2010-09-25",{"$f":"IFERROR(VLOOKUP(CONCATENATE(A45,B45),'[2]Raw Clinton'!C:F,2,FALSE),\"N/A\")","v":7147112.0300000003},{"$f":"IFERROR(VLOOKUP(CONCATENATE(A45,B45),'[2]Raw Clinton'!C:F,3,FALSE),\"N/A\")","v":512899.52},0.18356164383561643,-1.9999999552965164,0,1.9999999552965164,10.895522144525799,270,-1.9996958061932246,-10.893865212843687]
[1195,"2011-08-11",{"$f":"IFERROR(VLOOKUP(CONCATENATE(A46,B46),'[2]Raw Clinton'!C:F,2,FALSE),\"N/A\")","v":7147112.0499999998},{"$f":"IFERROR(VLOOKUP(CONCATENATE(A46,B46),'[2]Raw Clinton'!C:F,3,FALSE),\"N/A\")","v":512899.53},0.87671232876712324,1.9999999552965164,1.0000000009313226,2.2360679379322788,2.5505149917040058,63.434948289313482,1.9822565979547055,2.261011432042086]
[1195,"2012-08-06",{"$f":"IFERROR(VLOOKUP(CONCATENATE(A47,B47),'[2]Raw Clinton'!C:F,2,FALSE),\"N/A\")","v":7147112.0599999996},{"$f":"IFERROR(VLOOKUP(CONCATENATE(A47,B47),'[2]Raw Clinton'!C:F,3,FALSE),\"N/A\")","v":512899.52},0.989041095890411,0.99999997764825821,-1.0000000009313226,1.4142135472265713,1.4298835034285278,135.00000066701065,1.0172871113351314,1.0285589906851051]
[1195,"2014-09-11",{"$f":"IFERROR(VLOOKUP(CONCATENATE(A48,B48),'[2]Raw Clinton'!C:F,2,FALSE),\"N/A\")","v":7147112.0860000001},{"$f":"IFERROR(VLOOKUP(CONCATENATE(A48,B48),'[2]Raw Clinton'!C:F,3,FALSE),\"N/A\")","v":512899.54800000001},2.0986301369863014,2.6000000536441803,2.7999999991152436,3.8209946707624578,1.8207089488620065,42.87890420182071,2.5507748767859577,1.2154475587818205]
[1195,"2015-09-17",{"$f":"IFERROR(VLOOKUP(CONCATENATE(A49,B49),'[2]Raw Clinton'!C:F,2,FALSE),\"N/A\")","v":7147112.1119999997},{"$f":"IFERROR(VLOOKUP(CONCATENATE(A49,B49),'[2]Raw Clinton'!C:F,3,FALSE),\"N/A\")","v":512899.527},1.0164383561643835,2.5999999605119228,-2.1000000007916242,3.3421549631916863,3.288103939528209,128.92754402870796,2.6362269039553987,2.5935925065868481]
[null,"Totals From August 2, 2003 to September 17, 2015",null,null,null,{"$f":"IFERROR(IF($A49=$A40,(C49-C40)*100,\"\"),\"\")","v":17.199999932199717},{"$f":"IFERROR(IF($A49=$A40,(D49-D40)*100,\"\"),\"\")","v":-0.30000000260770321},17.202616012375412,{"$f":"IFERROR(SQRT(G50^2+H50^2)/F50,\"\")","v":1.0003041722437949},{"$f":"DEGREES(IF(G50=0,IF(F50>0,PI()/2,3*PI()/2),IF(G50>0,ATAN(F50/G50),PI()+ATAN(F50/G50))))","v":90.999243682879381},{"$f":"SUM(K41:K49)","v":17.202616012375412}]
[1834,"2001-06-19",{"$f":"IFERROR(VLOOKUP(CONCATENATE(A51,B51),'[2]Raw Clinton'!C:F,2,FALSE),\"N/A\")","v":"N/A"},{"$f":"IFERROR(VLOOKUP(CONCATENATE(A51,B51),'[2]Raw Clinton'!C:F,3,FALSE),\"N/A\")","v":"N/A"},{"$f":"IF(A51=A49,(B51-B49)/365,\"\")","v":""},{"$f":"IFERROR(IF($A51=$A49,(C51-C49)*100,\"\"),\"\")","v":""},{"$f":"IFERROR(IF($A51=$A49,(D51-D49)*100,\"\"),\"\")","v":""},"",""]
[1834,"2003-08-20",{"$f":"IFERROR(VLOOKUP(CONCATENATE(A52,B52),'[2]Raw Clinton'!C:F,2,FALSE),\"N/A\")","v":7146973.6200000001},{"$f":"IFERROR(VLOOKUP(CONCATENATE(A52,B52),'[2]Raw Clinton'!C:F,3,FALSE),\"N/A\")","v":512893.43},2.1698630136986301,"","","","",{"$f":"IFERROR(DEGREES(IF(G52=0,IF(F52>0,PI()/2,3*PI()/2),IF(G52>0,ATAN(F52/G52),PI()+ATAN(F52/G52)))),\"\")","v":""},{"$f":"IFERROR((F52*SIN(RADIANS($J$62))+G52*COS(RADIANS($J$62))),\"\")","v":""},{"$f":"IFERROR(K52/E52,\"\")","v":""}]
[1834,"2004-07-28",{"$f":"IFERROR(VLOOKUP(CONCATENATE(A53,B53),'[2]Raw Clinton'!C:F,2,FALSE),\"N/A\")","v":7146973.6399999997},{"$f":"IFERROR(VLOOKUP(CONCATENATE(A53,B53),'[2]Raw Clinton'!C:F,3,FALSE),\"N/A\")","v":512893.38},0.9397260273972603,{"$f":"IFERROR(IF($A53=$A52,(C53-C52)*100,\"\"),\"\")","v":1.9999999552965164},-4.9999999988358468,5.3851647894511583,5.7305689450427773,{"$f":"IFERROR(DEGREES(IF(G53=0,IF(F53>0,PI()/2,3*PI()/2),IF(G53>0,ATAN(F53/G53),PI()+ATAN(F53/G53)))),\"\")","v":158.19859095065519},{"$f":"IFERROR((F53*SIN(RADIANS($J$62))+G53*COS(RADIANS($J$62))),\"\")","v":3.3056391023352432},{"$f":"IFERROR(K53/E53,\"\")","v":3.51766260161039}]
[1834,"2006-07-28",{"$f":"IFERROR(VLOOKUP(CONCATENATE(A54,B54),'[2]Raw Clinton'!C:F,2,FALSE),\"N/A\")","v":7146973.6900000004},{"$f":"IFERROR(VLOOKUP(CONCATENATE(A54,B54),'[2]Raw Clinton'!C:F,3,FALSE),\"N/A\")","v":512893.36},2,5.000000074505806,-2.0000000018626451,5.3851648770031773,2.6925824385015886,111.8014092103474,5.3582105015047334,2.6791052507523667]
[1834,"2008-07-09",{"$f":"IFERROR(VLOOKUP(CONCATENATE(A55,B55),'[2]Raw Clinton'!C:F,2,FALSE),\"N/A\")","v":7146973.7400000002},{"$f":"IFERROR(VLOOKUP(CONCATENATE(A55,B55),'[2]Raw Clinton'!C:F,3,FALSE),\"N/A\")","v":512893.38},1.9506849315068493,4.9999999813735485,2.0000000018626451,5.3851647905320474,2.760653298517131,68.198590421646728,4.2512056739719926,2.1793399873592376]
[1834,"2010-07-20",{"$f":"IFERROR(VLOOKUP(CONCATENATE(A56,B56),'[2]Raw Clinton'!C:F,2,FALSE),\"N/A\")","v":7146973.79},{"$f":"IFERROR(VLOOKUP(CONCATENATE(A56,B56),'[2]Raw Clinton'!C:F,3,FALSE),\"N/A\")","v":512893.34},2.0301369863013701,4.9999999813735485,-3.9999999979045242,6.4031242215790005,3.1540355477413429,128.65980834356711,5.9117127794182069,2.9119772800103174]
[1834,"2010-09-25",{"$f":"IFERROR(VLOOKUP(CONCATENATE(A57,B57),'[2]Raw Clinton'!C:F,2,FALSE),\"N/A\")","v":7146973.7800000003},{"$f":"IFERROR(VLOOKUP(CONCATENATE(A57,B57),'[2]Raw Clinton'!C:F,3,FALSE),\"N/A\")","v":512893.4},0.18356164383561643,-0.99999997764825821,5.9999999997671694,6.0827625263939531,33.137437643787955,-9.4623220007114917,-2.6214486961454888,-14.281026479001543]
[1834,"2011-08-11",{"$f":"IFERROR(VLOOKUP(CONCATENATE(A58,B58),'[2]Raw Clinton'!C:F,2,FALSE),\"N/A\")","v":7146973.8300000001},{"$f":"IFERROR(VLOOKUP(CONCATENATE(A58,B58),'[2]Raw Clinton'!C:F,3,FALSE),\"N/A\")","v":512893.42},0.87671232876712324,4.9999999813735485,1.9999999960418791,5.3851647883702691,6.1424535867348382,68.19859047914764,4.251205675582896,4.849031473711741]
[1834,"2012-08-06",{"$f":"IFERROR(VLOOKUP(CONCATENATE(A59,B59),'[2]Raw Clinton'!C:F,2,FALSE),\"N/A\")","v":7146973.8200000003},{"$f":"IFERROR(VLOOKUP(CONCATENATE(A59,B59),'[2]Raw Clinton'!C:F,3,FALSE),\"N/A\")","v":512893.36},0.989041095890411,-0.99999997764825821,-5.9999999997671694,6.0827625263939531,6.1501615571573209,189.46232200071148,0.69956551474694051,0.70731693319288991]
[1834,"2014-09-11",{"$f":"IFERROR(VLOOKUP(CONCATENATE(A60,B60),'[2]Raw Clinton'!C:F,2,FALSE),\"N/A\")","v":7146973.8569999998},{"$f":"IFERROR(VLOOKUP(CONCATENATE(A60,B60),'[2]Raw Clinton'!C:F,3,FALSE),\"N/A\")","v":512893.36099999998},2.0986301369863014,3.6999999545514584,9.9999998928979039E-2,3.701351059203462,1.7636986117614408,88.451842298587692,3.5278088032564079,1.6810055002461997]
[1834,"2015-09-17",{"$f":"IFERROR(VLOOKUP(CONCATENATE(A61,B61),'[2]Raw Clinton'!C:F,2,FALSE),\"N/A\")","v":7146973.8700000001},{"$f":"IFERROR(VLOOKUP(CONCATENATE(A61,B61),'[2]Raw Clinton'!C:F,3,FALSE),\"N/A\")","v":512893.35800000001},1.0164383561643835,1.3000000268220901,-0.29999999678693712,1.3341664318253541,1.3125896162163189,102.99461639845516,1.3322494759921668,1.3107036623642612]
[null,"Totals From August 2, 2003 to September 17, 2015",null,null,null,{"$f":"IFERROR(IF($A61=$A52,(C61-C52)*100,\"\"),\"\")","v":25},{"$f":"IFERROR(IF($A61=$A52,(D61-D52)*100,\"\"),\"\")","v":-7.19999999855645},26.016148830663099,{"$f":"IFERROR(SQRT(G62^2+H62^2)/F62,\"\")","v":1.0797629369141548},{"$f":"DEGREES(IF(G62=0,IF(F62>0,PI()/2,3*PI()/2),IF(G62>0,ATAN(F62/G62),PI()+ATAN(F62/G62))))","v":106.06640053214167},{"$f":"SUM(K53:K61)","v":26.016148830663099}]
["BH-4","2001-06-19",{"$f":"IFERROR(VLOOKUP(CONCATENATE(A63,B63),'[2]Raw Clinton'!C:F,2,FALSE),\"N/A\")","v":"N/A"},{"$f":"IFERROR(VLOOKUP(CONCATENATE(A63,B63),'[2]Raw Clinton'!C:F,3,FALSE),\"N/A\")","v":"N/A"},{"$f":"IF(A63=A61,(B63-B61)/365,\"\")","v":""},{"$f":"IFERROR(IF($A63=$A61,(C63-C61)*100,\"\"),\"\")","v":""},{"$f":"IFERROR(IF($A63=$A61,(D63-D61)*100,\"\"),\"\")","v":""},"",""]
["BH-4","2003-08-20",{"$f":"IFERROR(VLOOKUP(CONCATENATE(A64,B64),'[2]Raw Clinton'!C:F,2,FALSE),\"N/A\")","v":"N/A"},{"$f":"IFERROR(VLOOKUP(CONCATENATE(A64,B64),'[2]Raw Clinton'!C:F,3,FALSE),\"N/A\")","v":"N/A"},2.1698630136986301,"","","","",{"$f":"IFERROR(DEGREES(IF(G64=0,IF(F64>0,PI()/2,3*PI()/2),IF(G64>0,ATAN(F64/G64),PI()+ATAN(F64/G64)))),\"\")","v":""},{"$f":"IFERROR((F64*SIN(RADIANS($J$74))+G64*COS(RADIANS($J$74))),\"\")","v":""},{"$f":"IFERROR(K64/E64,\"\")","v":""}]
["BH-4","2004-07-28",{"$f":"IFERROR(VLOOKUP(CONCATENATE(A65,B65),'[2]Raw Clinton'!C:F,2,FALSE),\"N/A\")","v":"N/A"},{"$f":"IFERROR(VLOOKUP(CONCATENATE(A65,B65),'[2]Raw Clinton'!C:F,3,FALSE),\"N/A\")","v":"N/A"},0.9397260273972603,"","","","",{"$f":"IFERROR(DEGREES(IF(G65=0,IF(F65>0,PI()/2,3*PI()/2),IF(G65>0,ATAN(F65/G65),PI()+ATAN(F65/G65)))),\"\")","v":""},{"$f":"IFERROR((F65*SIN(RADIANS($J$74))+G65*COS(RADIANS($J$74))),\"\")","v":""},{"$f":"IFERROR(K65/E65,\"\")","v":""}]
["BH-4","2006-07-28",{"$f":"IFERROR(VLOOKUP(CONCATENATE(A66,B66),'[2]Raw Clinton'!C:F,2,FALSE),\"N/A\")","v":"N/A"},{"$f":"IFERROR(VLOOKUP(CONCATENATE(A66,B66),'[2]Raw Clinton'!C:F,3,FALSE),\"N/A\")","v":"N/A"},2,"","","","","","",""]
["BH-4","2008-07-09",{"$f":"IFERROR(VLOOKUP(CONCATENATE(A67,B67),'[2]Raw Clinton'!C:F,2,FALSE),\"N/A\")","v":"N/A"},{"$f":"IFERROR(VLOOKUP(CONCATENATE(A67,B67),'[2]Raw Clinton'!C:F,3,FALSE),\"N/A\")","v":"N/A"},{"$f":"IF(A67=A66,(B67-B66)/365,\"\")","v":1.9506849315068493},"","","","","","",""]
["BH-4","2010-07-20",{"$f":"IFERROR(VLOOKUP(CONCATENATE(A68,B68),'[2]Raw Clinton'!C:F,2,FALSE),\"N/A\")","v":"N/A"},{"$f":"IFERROR(VLOOKUP(CONCATENATE(A68,B68),'[2]Raw Clinton'!C:F,3,FALSE),\"N/A\")","v":"N/A"},2.0301369863013701,"","","","","","",""]
["BH-4","2010-09-25",{"$f":"IFERROR(VLOOKUP(CONCATENATE(A69,B69),'[2]Raw Clinton'!C:F,2,FALSE),\"N/A\")","v":"N/A"},{"$f":"IFERROR(VLOOKUP(CONCATENATE(A69,B69),'[2]Raw Clinton'!C:F,3,FALSE),\"N/A\")","v":"N/A"},0.18356164383561643,{"$f":"IFERROR(IF($A69=$A68,(C69-C68)*100,\"\"),\"\")","v":""},"","","","","",""]
["BH-4","2011-08-11",{"$f":"IFERROR(VLOOKUP(CONCATENATE(A70,B70),'[2]Raw Clinton'!C:F,2,FALSE),\"N/A\")","v":"N/A"},{"$f":"IFERROR(VLOOKUP(CONCATENATE(A70,B70),'[2]Raw Clinton'!C:F,3,FALSE),\"N/A\")","v":"N/A"},0.87671232876712324,"","","","","","",""]
["BH-4","2012-08-06",{"$f":"IFERROR(VLOOKUP(CONCATENATE(A71,B71),'[2]Raw Clinton'!C:F,2,FALSE),\"N/A\")","v":7146871.2869999995},{"$f":"IFERROR(VLOOKUP(CONCATENATE(A71,B71),'[2]Raw Clinton'!C:F,3,FALSE),\"N/A\")","v":513025.11300000001},0.989041095890411,"","","","","","",""]
["BH-4","2014-09-11",{"$f":"IFERROR(VLOOKUP(CONCATENATE(A72,B72),'[2]Raw Clinton'!C:F,2,FALSE),\"N/A\")","v":7146871.2690000003},{"$f":"IFERROR(VLOOKUP(CONCATENATE(A72,B72),'[2]Raw Clinton'!C:F,3,FALSE),\"N/A\")","v":513025.13799999998},2.0986301369863014,-1.7999999225139618,2.4999999965075403,3.0805843120401639,1.467902446337676,-35.753886122838033,2.417545849508564,1.1519637533559084]
["BH-4","2015-09-17",{"$f":"IFERROR(VLOOKUP(CONCATENATE(A73,B73),'[2]Raw Clinton'!C:F,2,FALSE),\"N/A\")","v":7146871.2589999996},{"$f":"IFERROR(VLOOKUP(CONCATENATE(A73,B73),'[2]Raw Clinton'!C:F,3,FALSE),\"N/A\")","v":513025.12099999998},1.0164383561643835,-1.0000000707805157,-1.6999999992549419,1.9723083275765578,1.9404111578583387,210.46554670272741,0.49449809900135366,0.48650082516305687]
[null,"Totals From August 2, 2003 to September 17, 2015",null,null,null,{"$f":"IFERROR(IF($A73=$A71,(C73-C71)*100,\"\"),\"\")","v":-2.7999999932944775},{"$f":"IFERROR(IF($A73=$A71,(D73-D71)*100,\"\"),\"\")","v":0.7999999972525984},{"$f":"IFERROR(SQRT(F74^2+G74^2),\"\")","v":2.9120439485099174},{"$f":"IFERROR(SQRT(G74^2+H74^2)/F74,\"\")","v":-1.0785477763099072},{"$f":"DEGREES(IF(G74=0,IF(F74>0,PI()/2,3*PI()/2),IF(G74>0,ATAN(F74/G74),PI()+ATAN(F74/G74))))","v":-74.054604114808527},{"$f":"SUM(K65:K73)","v":2.9120439485099174}]
[2836,"2001-06-19",{"$f":"IFERROR(VLOOKUP(CONCATENATE(A75,B75),'[2]Raw Clinton'!C:F,2,FALSE),\"N/A\")","v":"N/A"},{"$f":"IFERROR(VLOOKUP(CONCATENATE(A75,B75),'[2]Raw Clinton'!C:F,3,FALSE),\"N/A\")","v":"N/A"},{"$f":"IF(A75=A73,(B75-B73)/365,\"\")","v":""},{"$f":"IFERROR(IF($A75=$A73,(C75-C73)*100,\"\"),\"\")","v":""},{"$f":"IFERROR(IF($A75=$A73,(D75-D73)*100,\"\"),\"\")","v":""},"",{"$f":"IFERROR(SQRT(F75^2+G75^2)/E75,\"\")","v":""}]
[2836,"2003-08-20",{"$f":"IFERROR(VLOOKUP(CONCATENATE(A76,B76),'[2]Raw Clinton'!C:F,2,FALSE),\"N/A\")","v":"N/A"},{"$f":"IFERROR(VLOOKUP(CONCATENATE(A76,B76),'[2]Raw Clinton'!C:F,3,FALSE),\"N/A\")","v":"N/A"},2.1698630136986301,{"$f":"IFERROR(IF($A76=$A75,(C76-C75)*100,\"\"),\"\")","v":""},"","","",{"$f":"IFERROR(DEGREES(IF(G76=0,IF(F76>0,PI()/2,3*PI()/2),IF(G76>0,ATAN(F76/G76),PI()+ATAN(F76/G76)))),\"\")","v":""},{"$f":"IFERROR((F76*SIN(RADIANS($J$86))+G76*COS(RADIANS($J$86))),\"\")","v":""},{"$f":"IFERROR(K76/E76,\"\")","v":""}]
[2836,"2004-07-28",{"$f":"IFERROR(VLOOKUP(CONCATENATE(A77,B77),'[2]Raw Clinton'!C:F,2,FALSE),\"N/A\")","v":"N/A"},{"$f":"IFERROR(VLOOKUP(CONCATENATE(A77,B77),'[2]Raw Clinton'!C:F,3,FALSE),\"N/A\")","v":"N/A"},0.9397260273972603,"","","","",{"$f":"IFERROR(DEGREES(IF(G77=0,IF(F77>0,PI()/2,3*PI()/2),IF(G77>0,ATAN(F77/G77),PI()+ATAN(F77/G77)))),\"\")","v":""},{"$f":"IFERROR((F77*SIN(RADIANS($J$86))+G77*COS(RADIANS($J$86))),\"\")","v":""},{"$f":"IFERROR(K77/E77,\"\")","v":""}]
[2836,"2006-07-28",{"$f":"IFERROR(VLOOKUP(CONCATENATE(A78,B78),'[2]Raw Clinton'!C:F,2,FALSE),\"N/A\")","v":"N/A"},{"$f":"IFERROR(VLOOKUP(CONCATENATE(A78,B78),'[2]Raw Clinton'!C:F,3,FALSE),\"N/A\")","v":"N/A"},2,"","","","","","",""]
[2836,"2008-07-09",{"$f":"IFERROR(VLOOKUP(CONCATENATE(A79,B79),'[2]Raw Clinton'!C:F,2,FALSE),\"N/A\")","v":"N/A"},{"$f":"IFERROR(VLOOKUP(CONCATENATE(A79,B79),'[2]Raw Clinton'!C:F,3,FALSE),\"N/A\")","v":"N/A"},1.9506849315068493,"","","","","","",""]
[2836,"2010-07-20",{"$f":"IFERROR(VLOOKUP(CONCATENATE(A80,B80),'[2]Raw Clinton'!C:F,2,FALSE),\"N/A\")","v":"N/A"},{"$f":"IFERROR(VLOOKUP(CONCATENATE(A80,B80),'[2]Raw Clinton'!C:F,3,FALSE),\"N/A\")","v":"N/A"},2.0301369863013701,"","","","","","",""]
[2836,"2010-09-25",{"$f":"IFERROR(VLOOKUP(CONCATENATE(A81,B81),'[2]Raw Clinton'!C:F,2,FALSE),\"N/A\")","v":"N/A"},{"$f":"IFERROR(VLOOKUP(CONCATENATE(A81,B81),'[2]Raw Clinton'!C:F,3,FALSE),\"N/A\")","v":"N/A"},0.18356164383561643,"","","","","","",""]
[2836,"2011-08-11",{"$f":"IFERROR(VLOOKUP(CONCATENATE(A82,B82),'[2]Raw Clinton'!C:F,2,FALSE),\"N/A\")","v":"N/A"},{"$f":"IFERROR(VLOOKUP(CONCATENATE(A82,B82),'[2]Raw Clinton'!C:F,3,FALSE),\"N/A\")","v":"N/A"},0.87671232876712324,"","","","","","",""]
[2836,"2012-08-06",{"$f":"IFERROR(VLOOKUP(CONCATENATE(A83,B83),'[2]Raw Clinton'!C:F,2,FALSE),\"N/A\")","v":7146814.7120000003},{"$f":"IFERROR(VLOOKUP(CONCATENATE(A83,B83),'[2]Raw Clinton'!C:F,3,FALSE),\"N/A\")","v":513092.91899999999},0.989041095890411,"","","","","","",""]
[2836,"2014-09-11",{"$f":"IFERROR(VLOOKUP(CONCATENATE(A84,B84),'[2]Raw Clinton'!C:F,2,FALSE),\"N/A\")","v":7146814.7439999999},{"$f":"IFERROR(VLOOKUP(CONCATENATE(A84,B84),'[2]Raw Clinton'!C:F,3,FALSE),\"N/A\")","v":513093.054},2.0986301369863014,3.1999999657273293,13.500000000931323,13.874076538847572,6.6110155831323283,13.335106202439093,13.871859810833415,6.6099593093396818]
[2836,"2015-09-17",{"$f":"IFERROR(VLOOKUP(CONCATENATE(A85,B85),'[2]Raw Clinton'!C:F,2,FALSE),\"N/A\")","v":7146814.7759999996},{"$f":"IFERROR(VLOOKUP(CONCATENATE(A85,B85),'[2]Raw Clinton'!C:F,3,FALSE),\"N/A\")","v":513093.16899999999},1.0164383561643835,3.1999999657273293,11.499999999068677,11.936917514971546,11.74386763602322,15.549804012416457,11.934340977400014,11.741332767522925]
[null,"Totals From August 2, 2003 to September 17, 2015",null,null,null,{"$f":"IFERROR(IF($A85=$A83,(C85-C83)*100,\"\"),\"\")","v":6.3999999314546585},{"$f":"IFERROR(IF($A85=$A83,(D85-D83)*100,\"\"),\"\")","v":25},25.806200788233429,{"$f":"IFERROR(SQRT(G86^2+H86^2)/F86,\"\")","v":5.6140519038123724},{"$f":"DEGREES(IF(G86=0,IF(F86>0,PI()/2,3*PI()/2),IF(G86>0,ATAN(F86/G86),PI()+ATAN(F86/G86))))","v":14.359336396812404},{"$f":"SUM(K77:K85)","v":25.806200788233429}]
[186,"2001-06-19",{"$f":"IFERROR(VLOOKUP(CONCATENATE(A87,B87),'[2]Raw Clinton'!C:F,2,FALSE),\"N/A\")","v":"N/A"},{"$f":"IFERROR(VLOOKUP(CONCATENATE(A87,B87),'[2]Raw Clinton'!C:F,3,FALSE),\"N/A\")","v":"N/A"},{"$f":"IF(A87=A85,(B87-B85)/365,\"\")","v":""},{"$f":"IFERROR(IF($A87=$A85,(C87-C85)*100,\"\"),\"\")","v":""},{"$f":"IFERROR(IF($A87=$A85,(D87-D85)*100,\"\"),\"\")","v":""},"",""]
[186,"2003-08-20",{"$f":"IFERROR(VLOOKUP(CONCATENATE(A88,B88),'[2]Raw Clinton'!C:F,2,FALSE),\"N/A\")","v":"N/A"},{"$f":"IFERROR(VLOOKUP(CONCATENATE(A88,B88),'[2]Raw Clinton'!C:F,3,FALSE),\"N/A\")","v":"N/A"},2.1698630136986301,"","","","",{"$f":"IFERROR(DEGREES(IF(G88=0,IF(F88>0,PI()/2,3*PI()/2),IF(G88>0,ATAN(F88/G88),PI()+ATAN(F88/G88)))),\"\")","v":""},{"$f":"IFERROR((F88*SIN(RADIANS($J$98))+G88*COS(RADIANS($J$98))),\"\")","v":""},{"$f":"IFERROR(K88/E88,\"\")","v":""}]
[186,"2004-07-28",{"$f":"IFERROR(VLOOKUP(CONCATENATE(A89,B89),'[2]Raw Clinton'!C:F,2,FALSE),\"N/A\")","v":"N/A"},{"$f":"IFERROR(VLOOKUP(CONCATENATE(A89,B89),'[2]Raw Clinton'!C:F,3,FALSE),\"N/A\")","v":"N/A"},0.9397260273972603,"","","","",{"$f":"IFERROR(DEGREES(IF(G89=0,IF(F89>0,PI()/2,3*PI()/2),IF(G89>0,ATAN(F89/G89),PI()+ATAN(F89/G89)))),\"\")","v":""},{"$f":"IFERROR((F89*SIN(RADIANS($J$98))+G89*COS(RADIANS($J$98))),\"\")","v":""},{"$f":"IFERROR(K89/E89,\"\")","v":""}]
[186,"2006-07-28",{"$f":"IFERROR(VLOOKUP(CONCATENATE(A90,B90),'[2]Raw Clinton'!C:F,2,FALSE),\"N/A\")","v":"N/A"},{"$f":"IFERROR(VLOOKUP(CONCATENATE(A90,B90),'[2]Raw Clinton'!C:F,3,FALSE),\"N/A\")","v":"N/A"},2,"","","","","","",""]
[186,"2008-07-09",{"$f":"IFERROR(VLOOKUP(CONCATENATE(A91,B91),'[2]Raw Clinton'!C:F,2,FALSE),\"N/A\")","v":"N/A"},{"$f":"IFERROR(VLOOKUP(CONCATENATE(A91,B91),'[2]Raw Clinton'!C:F,3,FALSE),\"N/A\")","v":"N/A"},1.9506849315068493,"","","","","","",""]
[186,"2010-07-20",{"$f":"IFERROR(VLOOKUP(CONCATENATE(A92,B92),'[2]Raw Clinton'!C:F,2,FALSE),\"N/A\")","v":"N/A"},{"$f":"IFERROR(VLOOKUP(CONCATENATE(A92,B92),'[2]Raw Clinton'!C:F,3,FALSE),\"N/A\")","v":"N/A"},2.0301369863013701,{"$f":"IFERROR(IF($A92=$A91,(C92-C91)*100,\"\"),\"\")","v":""},"","","","","",""]
[186,"2010-09-25",{"$f":"IFERROR(VLOOKUP(CONCATENATE(A93,B93),'[2]Raw Clinton'!C:F,2,FALSE),\"N/A\")","v":"N/A"},{"$f":"IFERROR(VLOOKUP(CONCATENATE(A93,B93),'[2]Raw Clinton'!C:F,3,FALSE),\"N/A\")","v":"N/A"},0.18356164383561643,"","","","","","",""]
[186,"2011-08-11",{"$f":"IFERROR(VLOOKUP(CONCATENATE(A94,B94),'[2]Raw Clinton'!C:F,2,FALSE),\"N/A\")","v":"N/A"},{"$f":"IFERROR(VLOOKUP(CONCATENATE(A94,B94),'[2]Raw Clinton'!C:F,3,FALSE),\"N/A\")","v":"N/A"},0.87671232876712324,"","","","","","",""]
[186,"2012-08-06",{"$f":"IFERROR(VLOOKUP(CONCATENATE(A95,B95),'[2]Raw Clinton'!C:F,2,FALSE),\"N/A\")","v":7146818.4869999997},{"$f":"IFERROR(VLOOKUP(CONCATENATE(A95,B95),'[2]Raw Clinton'!C:F,3,FALSE),\"N/A\")","v":513088.61900000001},0.989041095890411,"","","","","","",""]
[186,"2014-09-11",{"$f":"IFERROR(VLOOKUP(CONCATENATE(A96,B96),'[2]Raw Clinton'!C:F,2,FALSE),\"N/A\")","v":7146818.5089999996},{"$f":"IFERROR(VLOOKUP(CONCATENATE(A96,B96),'[2]Raw Clinton'!C:F,3,FALSE),\"N/A\")","v":513088.80499999999},2.0986301369863014,2.199999988079071,18.599999998696148,18.729655626813983,8.9247053574244166,6.745579611736523,18.715371777659183,8.9178990846548327]
[186,"2015-09-17",{"$f":"IFERROR(VLOOKUP(CONCATENATE(A97,B97),'[2]Raw Clinton'!C:F,2,FALSE),\"N/A\")","v":7146818.5060000001},{"$f":"IFERROR(VLOOKUP(CONCATENATE(A97,B97),'[2]Raw Clinton'!C:F,3,FALSE),\"N/A\")","v":513088.86},1.0164383561643835,-0.29999995604157448,5.4999999993015081,5.5081757384765364,5.419094729228938,-3.1221300059366959,5.4594084700541261,5.3711161497837097]
[null,"Totals From August 2, 2003 to September 17, 2015",null,null,null,{"$f":"IFERROR(IF($A97=$A95,(C97-C95)*100,\"\"),\"\")","v":1.9000000320374966},{"$f":"IFERROR(IF($A97=$A95,(D97-D95)*100,\"\"),\"\")","v":24.099999997997656},24.174780247713308,{"$f":"IFERROR(SQRT(G98^2+H98^2)/F98,\"\")","v":17.966034132406055},{"$f":"DEGREES(IF(G98=0,IF(F98>0,PI()/2,3*PI()/2),IF(G98>0,ATAN(F98/G98),PI()+ATAN(F98/G98))))","v":4.5077708694703782},{"$f":"SUM(K89:K97)","v":24.174780247713308}]
[300,"2001-06-19",{"$f":"IFERROR(VLOOKUP(CONCATENATE(A99,B99),'[2]Raw Clinton'!C:F,2,FALSE),\"N/A\")","v":"N/A"},{"$f":"IFERROR(VLOOKUP(CONCATENATE(A99,B99),'[2]Raw Clinton'!C:F,3,FALSE),\"N/A\")","v":"N/A"},{"$f":"IF(A99=A97,(B99-B97)/365,\"\")","v":""},{"$f":"IFERROR(IF($A99=$A97,(C99-C97)*100,\"\"),\"\")","v":""},{"$f":"IFERROR(IF($A99=$A97,(D99-D97)*100,\"\"),\"\")","v":""},"",""]
[300,"2003-08-20",{"$f":"IFERROR(VLOOKUP(CONCATENATE(A100,B100),'[2]Raw Clinton'!C:F,2,FALSE),\"N/A\")","v":"N/A"},{"$f":"IFERROR(VLOOKUP(CONCATENATE(A100,B100),'[2]Raw Clinton'!C:F,3,FALSE),\"N/A\")","v":"N/A"},2.1698630136986301,"","","","",{"$f":"IFERROR(DEGREES(IF(G100=0,IF(F100>0,PI()/2,3*PI()/2),IF(G100>0,ATAN(F100/G100),PI()+ATAN(F100/G100)))),\"\")","v":""},{"$f":"IFERROR((F100*SIN(RADIANS($J$110))+G100*COS(RADIANS($J$110))),\"\")","v":""},{"$f":"IFERROR(K100/E100,\"\")","v":""}]
[300,"2004-07-28",{"$f":"IFERROR(VLOOKUP(CONCATENATE(A101,B101),'[2]Raw Clinton'!C:F,2,FALSE),\"N/A\")","v":"N/A"},{"$f":"IFERROR(VLOOKUP(CONCATENATE(A101,B101),'[2]Raw Clinton'!C:F,3,FALSE),\"N/A\")","v":"N/A"},0.9397260273972603,"","","","",{"$f":"IFERROR(DEGREES(IF(G101=0,IF(F101>0,PI()/2,3*PI()/2),IF(G101>0,ATAN(F101/G101),PI()+ATAN(F101/G101)))),\"\")","v":""},{"$f":"IFERROR((F101*SIN(RADIANS($J$110))+G101*COS(RADIANS($J$110))),\"\")","v":""},{"$f":"IFERROR(K101/E101,\"\")","v":""}]
[300,"2006-07-28",{"$f":"IFERROR(VLOOKUP(CONCATENATE(A102,B102),'[2]Raw Clinton'!C:F,2,FALSE),\"N/A\")","v":"N/A"},{"$f":"IFERROR(VLOOKUP(CONCATENATE(A102,B102),'[2]Raw Clinton'!C:F,3,FALSE),\"N/A\")","v":"N/A"},2,"","","","","","",""]
[300,"2008-07-09",{"$f":"IFERROR(VLOOKUP(CONCATENATE(A103,B103),'[2]Raw Clinton'!C:F,2,FALSE),\"N/A\")","v":"N/A"},{"$f":"IFERROR(VLOOKUP(CONCATENATE(A103,B103),'[2]Raw Clinton'!C:F,3,FALSE),\"N/A\")","v":"N/A"},1.9506849315068493,"","","","","","",""]
[300,"2010-07-20",{"$f":"IFERROR(VLOOKUP(CONCATENATE(A104,B104),'[2]Raw Clinton'!C:F,2,FALSE),\"N/A\")","v":"N/A"},{"$f":"IFERROR(VLOOKUP(CONCATENATE(A104,B104),'[2]Raw Clinton'!C:F,3,FALSE),\"N/A\")","v":"N/A"},2.0301369863013701,"","","","","","",""]
[300,"2010-09-25",{"$f":"IFERROR(VLOOKUP(CONCATENATE(A105,B105),'[2]Raw Clinton'!C:F,2,FALSE),\"N/A\")","v":"N/A"},{"$f":"IFERROR(VLOOKUP(CONCATENATE(A105,B105),'[2]Raw Clinton'!C:F,3,FALSE),\"N/A\")","v":"N/A"},0.18356164383561643,"","","","","","",""]
[300,"2011-08-11",{"$f":"IFERROR(VLOOKUP(CONCATENATE(A106,B106),'[2]Raw Clinton'!C:F,2,FALSE),\"N/A\")","v":"N/A"},{"$f":"IFERROR(VLOOKUP(CONCATENATE(A106,B106),'[2]Raw Clinton'!C:F,3,FALSE),\"N/A\")","v":"N/A"},0.87671232876712324,"","","","","","",""]
[300,"2012-08-06",{"$f":"IFERROR(VLOOKUP(CONCATENATE(A107,B107),'[2]Raw Clinton'!C:F,2,FALSE),\"N/A\")","v":7146927.5559999999},{"$f":"IFERROR(VLOOKUP(CONCATENATE(A107,B107),'[2]Raw Clinton'!C:F,3,FALSE),\"N/A\")","v":513026.96399999998},0.989041095890411,"","","","","","",""]
[300,"2014-09-11",{"$f":"IFERROR(VLOOKUP(CONCATENATE(A108,B108),'[2]Raw Clinton'!C:F,2,FALSE),\"N/A\")","v":7146927.574},{"$f":"IFERROR(VLOOKUP(CONCATENATE(A108,B108),'[2]Raw Clinton'!C:F,3,FALSE),\"N/A\")","v":513026.97600000002},2.0986301369863014,{"$f":"IFERROR(IF($A108=$A107,(C108-C107)*100,\"\"),\"\")","v":1.8000000156462193},1.2000000046100467,2.1633307808540287,1.0308299412685646,56.309932602291497,1.6861495587715511,0.803452465994277]
[300,"2015-09-17",{"$f":"IFERROR(VLOOKUP(CONCATENATE(A109,B109),'[2]Raw Clinton'!C:F,2,FALSE),\"N/A\")","v":7146927.6119999997},{"$f":"IFERROR(VLOOKUP(CONCATENATE(A109,B109),'[2]Raw Clinton'!C:F,3,FALSE),\"N/A\")","v":513026.95899999997},1.0164383561643835,3.7999999709427357,-1.700000005075708,4.1629316348484755,4.0956065949317892,114.10223472824498,3.9361275466601935,3.8724704973880613]
[null,"Totals From August 2, 2003 to September 17, 2015",null,null,null,{"$f":"IFERROR(IF($A109=$A107,(C109-C107)*100,\"\"),\"\")","v":5.5999999865889549},{"$f":"IFERROR(IF($A109=$A107,(D109-D107)*100,\"\"),\"\")","v":-0.50000000046566129},5.6222771054317446,{"$f":"IFERROR(SQRT(G110^2+H110^2)/F110,\"\")","v":1.0079404137433343},{"$f":"DEGREES(IF(G110=0,IF(F110>0,PI()/2,3*PI()/2),IF(G110>0,ATAN(F110/G110),PI()+ATAN(F110/G110))))","v":95.102165269239194},{"$f":"SUM(K101:K109)","v":5.6222771054317446}]
["BH-4 Cable","2001-06-19",{"$f":"IFERROR(VLOOKUP(CONCATENATE(A111,B111),'[2]Raw Clinton'!C:F,2,FALSE),\"N/A\")","v":"N/A"},{"$f":"IFERROR(VLOOKUP(CONCATENATE(A111,B111),'[2]Raw Clinton'!C:F,3,FALSE),\"N/A\")","v":"N/A"},"",{"$f":"IFERROR(IF($A111=$A109,(C111-C109)*100,\"\"),\"\")","v":""},{"$f":"IFERROR(IF($A111=$A109,(D111-D109)*100,\"\"),\"\")","v":""},"",{"$f":"IFERROR(SQRT(F111^2+G111^2)/E111,\"\")","v":""}]
["BH-4 Cable","2003-08-20",{"$f":"IFERROR(VLOOKUP(CONCATENATE(A112,B112),'[2]Raw Clinton'!C:F,2,FALSE),\"N/A\")","v":"N/A"},{"$f":"IFERROR(VLOOKUP(CONCATENATE(A112,B112),'[2]Raw Clinton'!C:F,3,FALSE),\"N/A\")","v":"N/A"},2.1698630136986301,{"$f":"IFERROR(IF($A112=$A111,(C112-C111)*100,\"\"),\"\")","v":""},"","","",{"$f":"IFERROR(DEGREES(IF(G112=0,IF(F112>0,PI()/2,3*PI()/2),IF(G112>0,ATAN(F112/G112),PI()+ATAN(F112/G112)))),\"\")","v":""},{"$f":"IFERROR((F112*SIN(RADIANS($J$122))+G112*COS(RADIANS($J$122))),\"\")","v":""},{"$f":"IFERROR(K112/E112,\"\")","v":""}]
["BH-4 Cable","2004-07-28",{"$f":"IFERROR(VLOOKUP(CONCATENATE(A113,B113),'[2]Raw Clinton'!C:F,2,FALSE),\"N/A\")","v":"N/A"},{"$f":"IFERROR(VLOOKUP(CONCATENATE(A113,B113),'[2]Raw Clinton'!C:F,3,FALSE),\"N/A\")","v":"N/A"},0.9397260273972603,"","","","",{"$f":"IFERROR(DEGREES(IF(G113=0,IF(F113>0,PI()/2,3*PI()/2),IF(G113>0,ATAN(F113/G113),PI()+ATAN(F113/G113)))),\"\")","v":""},{"$f":"IFERROR((F113*SIN(RADIANS($J$122))+G113*COS(RADIANS($J$122))),\"\")","v":""},{"$f":"IFERROR(K113/E113,\"\")","v":""}]
["BH-4 Cable","2006-07-28",{"$f":"IFERROR(VLOOKUP(CONCATENATE(A114,B114),'[2]Raw Clinton'!C:F,2,FALSE),\"N/A\")","v":"N/A"},{"$f":"IFERROR(VLOOKUP(CONCATENATE(A114,B114),'[2]Raw Clinton'!C:F,3,FALSE),\"N/A\")","v":"N/A"},2,"","","","","","",""]
["BH-4 Cable","2008-07-09",{"$f":"IFERROR(VLOOKUP(CONCATENATE(A115,B115),'[2]Raw Clinton'!C:F,2,FALSE),\"N/A\")","v":"N/A"},{"$f":"IFERROR(VLOOKUP(CONCATENATE(A115,B115),'[2]Raw Clinton'!C:F,3,FALSE),\"N/A\")","v":"N/A"},1.9506849315068493,"","","","","","",""]
["BH-4 Cable","2010-07-20",{"$f":"IFERROR(VLOOKUP(CONCATENATE(A116,B116),'[2]Raw Clinton'!C:F,2,FALSE),\"N/A\")","v":"N/A"},{"$f":"IFERROR(VLOOKUP(CONCATENATE(A116,B116),'[2]Raw Clinton'!C:F,3,FALSE),\"N/A\")","v":"N/A"},2.0301369863013701,"","","","","","",""]
["BH-4 Cable","2010-09-25",{"$f":"IFERROR(VLOOKUP(CONCATENATE(A117,B117),'[2]Raw Clinton'!C:F,2,FALSE),\"N/A\")","v":"N/A"},{"$f":"IFERROR(VLOOKUP(CONCATENATE(A117,B117),'[2]Raw Clinton'!C:F,3,FALSE),\"N/A\")","v":"N/A"},0.18356164383561643,"","","","","","",""]
["BH-4 Cable","2011-08-11",{"$f":"IFERROR(VLOOKUP(CONCATENATE(A118,B118),'[2]Raw Clinton'!C:F,2,FALSE),\"N/A\")","v":"N/A"},{"$f":"IFERROR(VLOOKUP(CONCATENATE(A118,B118),'[2]Raw Clinton'!C:F,3,FALSE),\"N/A\")","v":"N/A"},0.87671232876712324,"","","","","","",""]
["BH-4 Cable","2012-08-06",{"$f":"IFERROR(VLOOKUP(CONCATENATE(A119,B119),'[2]Raw Clinton'!C:F,2,FALSE),\"N/A\")","v":7146871.3269999996},{"$f":"IFERROR(VLOOKUP(CONCATENATE(A119,B119),'[2]Raw Clinton'!C:F,3,FALSE),\"N/A\")","v":513025.21500000003},0.989041095890411,"","","","","","",""]
["BH-4 Cable","2014-09-11",{"$f":"IFERROR(VLOOKUP(CONCATENATE(A120,B120),'[2]Raw Clinton'!C:F,2,FALSE),\"N/A\")","v":7146871.2599999998},{"$f":"IFERROR(VLOOKUP(CONCATENATE(A120,B120),'[2]Raw Clinton'!C:F,3,FALSE),\"N/A\")","v":513025.10700000002},2.0986301369863014,-6.6999999806284904,-10.800000000745058,12.709445296963791,6.0560672759683856,211.81423862183263,-5.851942855835051,-2.7884584104174852]
["BH-4 Cable","2015-09-17",{"$f":"IFERROR(VLOOKUP(CONCATENATE(A121,B121),'[2]Raw Clinton'!C:F,2,FALSE),\"N/A\")","v":7146871.3660000004},{"$f":"IFERROR(VLOOKUP(CONCATENATE(A121,B121),'[2]Raw Clinton'!C:F,3,FALSE),\"N/A\")","v":513025.212},1.0164383561643835,10.600000061094761,10.499999998137355,14.920120685037817,14.678824932719147,45.271542115875462,9.7634643793858977,9.6055646859187416]
[null,"Totals From August 2, 2003 to September 17, 2015",null,null,null,{"$f":"IFERROR(IF($A121=$A119,(C121-C119)*100,\"\"),\"\")","v":3.9000000804662704},{"$f":"IFERROR(IF($A121=$A119,(D121-D119)*100,\"\"),\"\")","v":-0.30000000260770321},3.9115215235508467,{"$f":"IFERROR(SQRT(G122^2+H122^2)/F122,\"\")","v":1.0058997560612204},{"$f":"DEGREES(IF(G122=0,IF(F122>0,PI()/2,3*PI()/2),IF(G122>0,ATAN(F122/G122),PI()+ATAN(F122/G122))))","v":94.398705302680966},{"$f":"SUM(K113:K121)","v":3.9115215235508467}]
[]
[null,null,null,null,null,null,null,null,null,{"$f":"90-J120+360","v":238.18576137816737}]
[null,null,null,null,null,null,null,null,null,{"$f":"90-J121","v":44.728457884124538}]

{"sheet":"Wolverine Movement Nov. 2","index":10,"n_rows":93,"n_cols":38,"rows_kept":93,"cut":false,"hidden":false,"merged":[]}
[]
["Monitor","Date","Northing\n(m)","Easting\n(m)","dt\n(years)","dN\n(cm)","dE\n(cm)","Movement\n(cm)","Movement Rate\n(cm/yr)","θ","Projected Movement\n(cm)","Projected Movement Rate\n(cm/yr)",null,"Movement Rates (cm)"]
["80-1","2003-08-21",{"$f":"IFERROR(VLOOKUP(CONCATENATE(A3,B3),'[2]Raw Wolverine'!C:F,2,FALSE),\"N/A\")","v":7148407.9800000004},{"$f":"IFERROR(VLOOKUP(CONCATENATE(A3,B3),'[2]Raw Wolverine'!C:F,3,FALSE),\"N/A\")","v":513543.04},{"$f":"IF(A3=A2,(B3-B2)/365,\"\")","v":""},{"$f":"IFERROR(IF($A3=$A2,(C3-C2)*100,\"\"),\"\")","v":""},{"$f":"IFERROR(IF($A3=$A2,(D3-D2)*100,\"\"),\"\")","v":""},{"$f":"IFERROR(SQRT(F3^2+G3^2),\"\")","v":""},{"$f":"IFERROR(SQRT(F3^2+G3^2)/E3,\"\")","v":""},null,null,null,null,"Date","Avg. Date","dt","80-1","80-2",26,"26-A","BH-14",1483,1495,"Mean","Std.Dev","95%ile","5%ile",null,null,"mean","90% C.I.","90% C.I.",null,"Lookup Tables"]
["80-1","2004-07-28",{"$f":"IFERROR(VLOOKUP(CONCATENATE(A4,B4),'[2]Raw Wolverine'!C:F,2,FALSE),\"N/A\")","v":7148408.0099999998},{"$f":"IFERROR(VLOOKUP(CONCATENATE(A4,B4),'[2]Raw Wolverine'!C:F,3,FALSE),\"N/A\")","v":513543.07},0.93698630136986305,{"$f":"IFERROR(IF($A4=$A3,(C4-C3)*100,\"\"),\"\")","v":2.9999999329447746},{"$f":"IFERROR(IF($A4=$A3,(D4-D3)*100,\"\"),\"\")","v":3.0000000027939677},{"$f":"IFERROR(SQRT(F4^2+G4^2),\"\")","v":4.2426406416797144},{"$f":"IFERROR(SQRT(F4^2+G4^2)/E4,\"\")","v":4.5279644275236715},{"$f":"IFERROR(DEGREES(IF(G4=0,IF(F4>0,PI()/2,3*PI()/2),IF(G4>0,ATAN(F4/G4),PI()+ATAN(F4/G4)))),\"\")","v":44.999999332989333},{"$f":"IFERROR((F4*SIN(RADIANS($J$15))+G4*COS(RADIANS($J$15))),\"\")","v":3.8328555310123202},{"$f":"IFERROR(K4/E4,\"\")","v":4.0906206690628562},null,"2003-08-21",null,null,null,null,null,null,null,null,null,null,null,null,null,null,{"$f":"N4","v":"2003-08-21"},{"$f":"X5","v":4.0715901542136104},{"$f":"Z5","v":6.0782865142092479},{"$f":"AA5","v":2.0648937942179733},null,"80-1",0,null,"2003-08-21",0]
["80-1","2004-09-23",{"$f":"IFERROR(VLOOKUP(CONCATENATE(A5,B5),'[2]Raw Wolverine'!C:F,2,FALSE),\"N/A\")","v":7148408.0300000003},{"$f":"IFERROR(VLOOKUP(CONCATENATE(A5,B5),'[2]Raw Wolverine'!C:F,3,FALSE),\"N/A\")","v":513543.06},0.15616438356164383,{"$f":"IFERROR(IF($A5=$A4,(C5-C4)*100,\"\"),\"\")","v":2.0000000484287739},-1.0000000009313226,{"$f":"IFERROR(SQRT(F5^2+G5^2),\"\")","v":2.2360680212323021},{"$f":"IFERROR(SQRT(F5^2+G5^2)/E5,\"\")","v":14.318681188592812},{"$f":"IFERROR(DEGREES(IF(G5=0,IF(F5>0,PI()/2,3*PI()/2),IF(G5>0,ATAN(F5/G5),PI()+ATAN(F5/G5)))),\"\")","v":116.56505064346946},-0.27075357801783728,{"$f":"IFERROR(K5/E5,\"\")","v":-1.7337729118686072},null,"2004-07-28",{"$f":"AVERAGE(N4:N5)","v":"2004-02-08"},{"$f":"(N5-N4)/365","v":0.93698630136986305},{"$f":"INDIRECT(\"L\"&TEXT(3+VLOOKUP(Q$3,$AH$4:$AI$10,2,FALSE)*13+VLOOKUP($N5,$AK$4:$AL$15,2,FALSE)*1,0))","v":4.0906206690628562},{"$f":"INDIRECT(\"L\"&TEXT(3+VLOOKUP(R$3,$AH$4:$AI$10,2,FALSE)*13+VLOOKUP($N5,$AK$4:$AL$15,2,FALSE)*1,0))","v":9.9806973904828151},3.4032470470525218,2.9888150702110043,0,1.8532675275364259,6.1844833751496502,{"$f":"AVERAGE(Q5:W5)","v":4.0715901542136104},{"$f":"_xlfn.STDEV.S(Q5:W5)","v":3.2274890731714279},{"$f":"X5+1.645*Y5/SQRT(COUNT(Q5:W5))","v":6.0782865142092479},{"$f":"X5-1.645*Y5/SQRT(COUNT(Q5:W5))","v":2.0648937942179733},null,{"$f":"N5","v":"2004-07-28"},{"$f":"X5","v":4.0715901542136104},{"$f":"Z5","v":6.0782865142092479},{"$f":"AA5","v":2.0648937942179733},null,"80-2",1,null,"2004-07-28",1]
["80-1","2005-09-17",{"$f":"IFERROR(VLOOKUP(CONCATENATE(A6,B6),'[2]Raw Wolverine'!C:F,2,FALSE),\"N/A\")","v":7148408.0099999998},{"$f":"IFERROR(VLOOKUP(CONCATENATE(A6,B6),'[2]Raw Wolverine'!C:F,3,FALSE),\"N/A\")","v":513543.12},0.98356164383561639,-2.0000000484287739,5.9999999997671694,6.3245553354303992,6.4302582101172581,-18.434949239803675,4.9807379557845577,5.0639814870790074,null,"2004-09-23","2004-08-25T12:00:00",0.15616438356164383,{"$f":"INDIRECT(\"L\"&TEXT(3+VLOOKUP(Q$3,$AH$4:$AI$10,2,FALSE)*13+VLOOKUP($N6,$AK$4:$AL$15,2,FALSE)*1,0))","v":-1.7337729118686072},-13.378032779967707,3.0544377164877505,-15.354556199121253,-23.000381614670388,-2.382772610928984,1.4735593193027363,-7.3316455829666358,9.8966750606068139,{"$f":"X6+1.645*Y6/SQRT(COUNT(Q6:W6))","v":-1.1783724440231689},{"$f":"X6-1.645*Y6/SQRT(COUNT(Q6:W6))","v":-13.484918721910102},null,{"$f":"N5","v":"2004-07-28"},{"$f":"X6","v":-7.3316455829666358},{"$f":"Z6","v":-1.1783724440231689},{"$f":"AA6","v":-13.484918721910102},null,26,2,null,"2004-09-23",2]
["80-1","2006-07-28",{"$f":"IFERROR(VLOOKUP(CONCATENATE(A7,B7),'[2]Raw Wolverine'!C:F,2,FALSE),\"N/A\")","v":7148408.0199999996},{"$f":"IFERROR(VLOOKUP(CONCATENATE(A7,B7),'[2]Raw Wolverine'!C:F,3,FALSE),\"N/A\")","v":513543.14},0.86027397260273974,0.99999997764825821,2.0000000018626451,2.2360679691697873,2.5992509832706125,26.565050643469458,2.2196153869874129,2.5801261664025659,null,"2005-09-17","2005-03-21T12:00:00",0.98356164383561639,5.0639814870790074,9.1054687744805243,0.81725824604751529,6.9104667710359795,-4.9655805941823363,3.152693501051115,4.0411866974020825,3.4464964118448411,4.5598835217758582,6.2816110962643119,0.61138172742537078,null,{"$f":"N6","v":"2004-09-23"},{"$f":"X6","v":-7.3316455829666358},{"$f":"Z6","v":-1.1783724440231689},{"$f":"AA6","v":-13.484918721910102},null,"26-A",3,null,"2005-09-17",3]
["80-1","2008-07-09",{"$f":"IFERROR(VLOOKUP(CONCATENATE(A8,B8),'[2]Raw Wolverine'!C:F,2,FALSE),\"N/A\")","v":7148408.04},{"$f":"IFERROR(VLOOKUP(CONCATENATE(A8,B8),'[2]Raw Wolverine'!C:F,3,FALSE),\"N/A\")","v":513543.21},1.9506849315068493,2.0000000484287739,7.0000000006984919,7.2801099032565419,3.7320788127649407,15.945396265890951,7.2652214296988022,3.7244463789888522,null,"2006-07-28","2006-02-21",0.86027397260273974,2.5801261664025659,3.5852066840937002,2.6850626714861074,-2.556764122850534,11.430204732432225,0.72090247754331682,3.2585538958488134,3.1004703578508845,4.2378139284333214,5.7353377707929418,0.4656029449088277,null,{"$f":"N6","v":"2004-09-23"},{"$f":"X7","v":3.4464964118448411},{"$f":"Z7","v":6.2816110962643119},{"$f":"AA7","v":0.61138172742537078},null,"BH-14",4,null,"2006-07-28",4]
["80-1","2010-07-20",{"$f":"IFERROR(VLOOKUP(CONCATENATE(A9,B9),'[2]Raw Wolverine'!C:F,2,FALSE),\"N/A\")","v":7148408.0300000003},{"$f":"IFERROR(VLOOKUP(CONCATENATE(A9,B9),'[2]Raw Wolverine'!C:F,3,FALSE),\"N/A\")","v":513543.24},2.0301369863013701,-0.99999997764825821,2.9999999969732016,3.1622776502286647,1.5576671286551451,-18.434948456066145,2.4903689907793081,1.2266999752151786,null,"2008-07-09","2007-07-19",1.9506849315068493,3.7244463789888522,4.5403504023920789,1.3516888166721732,2.6648657822098869,3.9287627147813926,1.7168010076228075,2.6596314014946256,2.940935214880259,1.1780900287161606,3.673414525816816,2.2084559039437019,null,{"$f":"N7","v":"2005-09-17"},{"$f":"X7","v":3.4464964118448411},{"$f":"Z7","v":6.2816110962643119},{"$f":"AA7","v":0.61138172742537078},null,1483,5,null,"2008-07-09",5]
["80-1","2010-09-25",{"$f":"IFERROR(VLOOKUP(CONCATENATE(A10,B10),'[2]Raw Wolverine'!C:F,2,FALSE),\"N/A\")","v":7148408.04},{"$f":"IFERROR(VLOOKUP(CONCATENATE(A10,B10),'[2]Raw Wolverine'!C:F,3,FALSE),\"N/A\")","v":513543.27},0.18356164383561643,0.99999997764825821,3.0000000027939677,3.1622776557507284,17.227333497746507,18.434948422715614,3.1616122636373856,17.223708600412625,null,"2010-07-20","2009-07-14T12:00:00",2.0301369863013701,1.2266999752151786,2.9897111959374345,0.1979728249295945,-0.49139313917612931,-7.5178956646530439,-1.7107084844672924,1.7723928836961498,-0.50474577264544396,3.4527067530064142,1.6419800306993033,-2.651471575990191,null,{"$f":"N7","v":"2005-09-17"},{"$f":"X8","v":3.1004703578508845},{"$f":"Z8","v":5.7353377707929418},{"$f":"AA8","v":0.4656029449088277},null,1495,6,null,"2010-07-20",6]
["80-1","2011-08-11",{"$f":"IFERROR(VLOOKUP(CONCATENATE(A11,B11),'[2]Raw Wolverine'!C:F,2,FALSE),\"N/A\")","v":7148408.0499999998},{"$f":"IFERROR(VLOOKUP(CONCATENATE(A11,B11),'[2]Raw Wolverine'!C:F,3,FALSE),\"N/A\")","v":513543.29},0.87671232876712324,0.99999997764825821,1.9999999960418791,2.2360679639635359,2.5505150213959085,26.565050710170524,2.2196153815042696,2.5317487945283075,null,"2010-09-25","2010-08-22T12:00:00",0.18356164383561643,17.223708600412625,15.723690952968198,19.152287322137596,9.7889385405176927,7.8463692246871215,16.892790271153906,7.635715845496474,13.466214393910517,4.8714737924859097,16.495060814632819,10.437367973188216,null,{"$f":"N8","v":"2006-07-28"},{"$f":"X8","v":3.1004703578508845},{"$f":"Z8","v":5.7353377707929418},{"$f":"AA8","v":0.4656029449088277},null,null,null,null,"2010-09-25",7]
["80-1","2012-08-06",{"$f":"IFERROR(VLOOKUP(CONCATENATE(A12,B12),'[2]Raw Wolverine'!C:F,2,FALSE),\"N/A\")","v":7148408.0700000003},{"$f":"IFERROR(VLOOKUP(CONCATENATE(A12,B12),'[2]Raw Wolverine'!C:F,3,FALSE),\"N/A\")","v":513543.32},0.989041095890411,2.0000000484287739,3.0000000027939677,3.6055513046521619,3.645502011628917,33.690068141681934,3.497233928582054,3.5359844430261762,null,"2011-08-11","2011-03-04",0.87671232876712324,2.5317487945283075,5.7880280116507299,0.54407171824938061,2.2826193319651868,0.45296231960424554,0.42443137132172526,1.1214957937047099,1.8779081915748979,1.9310912591442952,3.0785671907814995,0.67724919236829617,null,{"$f":"N8","v":"2006-07-28"},{"$f":"X9","v":2.940935214880259},{"$f":"Z9","v":3.673414525816816},{"$f":"AA9","v":2.2084559039437019},null,null,null,null,"2011-08-11",8]
["80-1","2014-09-13",{"$f":"IFERROR(VLOOKUP(CONCATENATE(A13,B13),'[2]Raw Wolverine'!C:F,2,FALSE),\"N/A\")","v":7148408.0590000004},{"$f":"IFERROR(VLOOKUP(CONCATENATE(A13,B13),'[2]Raw Wolverine'!C:F,3,FALSE),\"N/A\")","v":513543.397},2.1041095890410957,-1.0999999940395355,7.6999999990221113,7.7781745912410249,3.6966584971392895,-8.1301023117098463,6.884192139220735,3.2717840244994383,null,"2012-08-06","2012-02-07T12:00:00",0.989041095890411,3.5359844430261762,4.9304746721815436,4.1127736982601126,1.6162690735917107,2.2592870375643868,2.7589997539861804,3.6380696605032119,3.2645511913019036,1.1321768660827325,3.9684839218338199,2.5606184607699873,null,{"$f":"N9","v":"2008-07-09"},{"$f":"X9","v":2.940935214880259},{"$f":"Z9","v":3.673414525816816},{"$f":"AA9","v":2.2084559039437019},null,null,null,null,"2012-08-06",9]
["80-1","2015-09-17",{"$f":"IFERROR(VLOOKUP(CONCATENATE(A14,B14),'[2]Raw Wolverine'!C:F,2,FALSE),\"N/A\")","v":7148408.0990000004},{"$f":"IFERROR(VLOOKUP(CONCATENATE(A14,B14),'[2]Raw Wolverine'!C:F,3,FALSE),\"N/A\")","v":513543.37400000001},{"$f":"IF(A14=A12,(B14-B12)/365,\"\")","v":3.1150684931506851},4.0000000037252903,-2.2999999986495823,4.6141088005800643,1.48122226227944,119.89890180101885,-0.82410624699798118,-0.26455477586126924,null,"2014-09-13","2013-08-25",2.1041095890410957,3.2717840244994383,6.6353196474399398,0.99662520864478366,0.71003396167973243,7.9127563045037723,0.31242863692204165,3.0672113917251846,3.272308453630699,2.9830224873204929,5.127007332970086,1.4176095742913117,null,{"$f":"N9","v":"2008-07-09"},{"$f":"X10","v":-0.50474577264544396},{"$f":"Z10","v":1.6419800306993033},{"$f":"AA10","v":-2.651471575990191},null,null,null,null,"2014-09-13",10]
[null,"Totals From August 21, 2003 to September 17, 2015",null,null,null,{"$f":"IFERROR(IF($A14=$A3,(C14-C3)*100,\"\"),\"\")","v":11.899999994784594},{"$f":"IFERROR(IF($A14=$A3,(D14-D3)*100,\"\"),\"\")","v":33.400000003166497},35.456593182191028,{"$f":"IFERROR(SQRT(G15^2+H15^2)/F15,\"\")","v":4.0933341573271864},{"$f":"DEGREES(IF(G15=0,IF(F15>0,PI()/2,3*PI()/2),IF(G15>0,ATAN(F15/G15),PI()+ATAN(F15/G15))))","v":19.610344049524294},{"$f":"SUM(K4:K14)","v":35.456593182191035},"",null,"2015-09-17","2015-03-16T12:00:00",1.010958904109589,{"$f":"INDIRECT(\"L\"&TEXT(3+VLOOKUP(Q$3,$AH$4:$AI$10,2,FALSE)*13+VLOOKUP($N15,$AK$4:$AL$15,2,FALSE)*1,0))","v":-0.26455477586126924},-0.78321141062841659,2.6374072593128153,0.54272982168047301,2.3656715523247787,1.8648908137625091,-0.55871094229439322,0.82917461689949956,1.4438112639000407,1.7268665198319382,-6.8517286032939051E-2,null,{"$f":"N10","v":"2010-07-20"},{"$f":"X10","v":-0.50474577264544396},{"$f":"Z10","v":1.6419800306993033},{"$f":"AA10","v":-2.651471575990191},null,null,null,null,"2015-09-17",11]
["80-2","2003-08-21",{"$f":"IFERROR(VLOOKUP(CONCATENATE(A16,B16),'[2]Raw Wolverine'!C:F,2,FALSE),\"N/A\")","v":7148290.0499999998},{"$f":"IFERROR(VLOOKUP(CONCATENATE(A16,B16),'[2]Raw Wolverine'!C:F,3,FALSE),\"N/A\")","v":513549.41},{"$f":"IF(A16=A14,(B16-B14)/365,\"\")","v":""},{"$f":"IFERROR(IF($A16=$A14,(C16-C14)*100,\"\"),\"\")","v":""},{"$f":"IFERROR(IF($A16=$A14,(D16-D14)*100,\"\"),\"\")","v":""},"","",null,null,{"$f":"IFERROR(K16/E16,\"\")","v":""},null,null,null,"Total Movement",{"$f":"SUMPRODUCT($P$5:$P$15,Q5:Q15)","v":36.013245422907346},{"$f":"SUMPRODUCT($P$5:$P$15,R5:R15)","v":60.2357600097817},22.64177554595458,16.640012050611809,16.871573730431159,13.705838171154522,33.461171512498829,{"$f":"SUMPRODUCT($P$5:$P$13,X5:X13)","v":20.786353862876336},null,null,null,null,{"$f":"N10","v":"2010-07-20"},{"$f":"X11","v":13.466214393910517},{"$f":"Z11","v":16.495060814632819},{"$f":"AA11","v":10.437367973188216}]
["80-2","2004-07-28",{"$f":"IFERROR(VLOOKUP(CONCATENATE(A17,B17),'[2]Raw Wolverine'!C:F,2,FALSE),\"N/A\")","v":7148290.0899999999},{"$f":"IFERROR(VLOOKUP(CONCATENATE(A17,B17),'[2]Raw Wolverine'!C:F,3,FALSE),\"N/A\")","v":513549.5},0.93698630136986305,4.0000000037252903,9.0000000025611371,9.8488578056494855,10.511207891994333,{"$f":"IFERROR(DEGREES(IF(G17=0,IF(F17>0,PI()/2,3*PI()/2),IF(G17>0,ATAN(F17/G17),PI()+ATAN(F17/G17)))),\"\")","v":23.962488988330982},{"$f":"IFERROR((F17*SIN(RADIANS($J$28))+G17*COS(RADIANS($J$28))),\"\")","v":9.351776733000337},9.9806973904828151,null,null,null,"Average Movement",{"$f":"Q16/SUM($P5:$P15)","v":2.9806881132338279},{"$f":"R16/SUM($P5:$P15)","v":4.9854994112404354},1.873979155164041,1.3772345574769409,1.3964000933350051,1.1343834313994103,2.7694620412839166,null,null,null,null,null,{"$f":"N11","v":"2010-09-25"},{"$f":"X11","v":13.466214393910517},{"$f":"Z11","v":16.495060814632819},{"$f":"AA11","v":10.437367973188216}]
["80-2","2004-09-23",{"$f":"IFERROR(VLOOKUP(CONCATENATE(A18,B18),'[2]Raw Wolverine'!C:F,2,FALSE),\"N/A\")","v":7148290.0800000001},{"$f":"IFERROR(VLOOKUP(CONCATENATE(A18,B18),'[2]Raw Wolverine'!C:F,3,FALSE),\"N/A\")","v":513549.48},0.15616438356164383,-0.99999997764825821,-2.0000000018626451,2.2360679691697873,14.318680855210042,{"$f":"IFERROR(DEGREES(IF(G18=0,IF(F18>0,PI()/2,3*PI()/2),IF(G18>0,ATAN(F18/G18),PI()+ATAN(F18/G18)))),\"\")","v":206.56505064346948},-2.0891722423511214,-13.378032779967707,null,null,null,"Direction of Movement",{"$f":"J15","v":19.610344049524294},{"$f":"J28","v":5.6814003360246872},{"$f":"J41","v":28.489284428901435},{"$f":"J54","v":36.938762891761478},{"$f":"J67","v":61.308231341005438},{"$f":"J80","v":29.744881284869631},{"$f":"J93","v":37.349349009820088},null,null,null,null,null,{"$f":"N11","v":"2010-09-25"},{"$f":"X12","v":1.8779081915748979},{"$f":"Z12","v":3.0785671907814995},{"$f":"AA12","v":0.67724919236829617}]
["80-2","2005-09-17",{"$f":"IFERROR(VLOOKUP(CONCATENATE(A19,B19),'[2]Raw Wolverine'!C:F,2,FALSE),\"N/A\")","v":7148290.0800000001},{"$f":"IFERROR(VLOOKUP(CONCATENATE(A19,B19),'[2]Raw Wolverine'!C:F,3,FALSE),\"N/A\")","v":513549.57},0.98356164383561639,0,9.0000000025611371,9.0000000025611371,9.1504178299019916,0,8.9557898357219408,9.1054687744805243,null,null,null,null,null,null,null,null,null,null,null,null,null,null,null,null,{"$f":"N12","v":"2011-08-11"},{"$f":"X12","v":1.8779081915748979},{"$f":"Z12","v":3.0785671907814995},{"$f":"AA12","v":0.67724919236829617}]
["80-2","2006-07-28",{"$f":"IFERROR(VLOOKUP(CONCATENATE(A20,B20),'[2]Raw Wolverine'!C:F,2,FALSE),\"N/A\")","v":7148290.0899999999},{"$f":"IFERROR(VLOOKUP(CONCATENATE(A20,B20),'[2]Raw Wolverine'!C:F,3,FALSE),\"N/A\")","v":513549.6},0.86027397260273974,0.99999997764825821,2.9999999969732016,3.1622776502286647,3.675895994692556,18.434948456066145,3.0842599967271833,3.5852066840937002,null,null,null,null,null,null,null,null,null,null,null,{"$f":"SUMPRODUCT(X5:X10,P5:P10)/SUM(P5:P10)","v":1.9427125521560009},null,null,null,null,{"$f":"N12","v":"2011-08-11"},{"$f":"X13","v":3.2645511913019036},{"$f":"Z13","v":3.9684839218338199},{"$f":"AA13","v":2.5606184607699873}]
["80-2","2008-07-09",{"$f":"IFERROR(VLOOKUP(CONCATENATE(A21,B21),'[2]Raw Wolverine'!C:F,2,FALSE),\"N/A\")","v":7148290.0800000001},{"$f":"IFERROR(VLOOKUP(CONCATENATE(A21,B21),'[2]Raw Wolverine'!C:F,3,FALSE),\"N/A\")","v":513549.69},1.9506849315068493,{"$f":"IFERROR(IF($A21=$A20,(C21-C20)*100,\"\"),\"\")","v":-0.99999997764825821},9.0000000025611371,9.055385138214552,4.6421567070903249,-6.3401916035600729,8.8567931137072886,4.5403504023920789,null,null,null,null,null,null,null,null,null,null,null,{"$f":"SUMPRODUCT(X11:X13,P11:P13)/SUM(P11:P13)","v":3.5851202750748117},null,null,null,null,{"$f":"N13","v":"2012-08-06"},{"$f":"X13","v":3.2645511913019036},{"$f":"Z13","v":3.9684839218338199},{"$f":"AA13","v":2.5606184607699873}]
["80-2","2010-07-20",{"$f":"IFERROR(VLOOKUP(CONCATENATE(A22,B22),'[2]Raw Wolverine'!C:F,2,FALSE),\"N/A\")","v":7148290.0899999999},{"$f":"IFERROR(VLOOKUP(CONCATENATE(A22,B22),'[2]Raw Wolverine'!C:F,3,FALSE),\"N/A\")","v":513549.75},2.0301369863013701,0.99999997764825821,5.9999999997671694,6.0827625263939531,2.9962325534868999,9.4623220007114917,6.0695232772318883,2.9897111959374345,null,null,null,null,null,null,null,null,null,null,null,{"$f":"SUMPRODUCT(X14,P14)/SUM(P14)","v":3.272308453630699},null,null,null,null,{"$f":"N13","v":"2012-08-06"},{"$f":"X14","v":3.272308453630699},{"$f":"Z14","v":5.127007332970086},{"$f":"AA14","v":1.4176095742913117}]
["80-2","2010-09-25",{"$f":"IFERROR(VLOOKUP(CONCATENATE(A23,B23),'[2]Raw Wolverine'!C:F,2,FALSE),\"N/A\")","v":7148290.0800000001},{"$f":"IFERROR(VLOOKUP(CONCATENATE(A23,B23),'[2]Raw Wolverine'!C:F,3,FALSE),\"N/A\")","v":513549.78},0.18356164383561643,-0.99999997764825821,3.0000000027939677,3.1622776557507284,17.227333497746507,-18.434948422715614,2.8862665584900529,15.723690952968198,null,null,null,null,null,null,null,null,null,null,null,{"$f":"SUMPRODUCT(X15,P15)/SUM(P15)","v":0.82917461689949956},null,null,null,null,{"$f":"N14","v":"2014-09-13"},{"$f":"X14","v":3.272308453630699},{"$f":"Z14","v":5.127007332970086},{"$f":"AA14","v":1.4176095742913117}]
["80-2","2011-08-11",{"$f":"IFERROR(VLOOKUP(CONCATENATE(A24,B24),'[2]Raw Wolverine'!C:F,2,FALSE),\"N/A\")","v":7148290.0899999999},{"$f":"IFERROR(VLOOKUP(CONCATENATE(A24,B24),'[2]Raw Wolverine'!C:F,3,FALSE),\"N/A\")","v":513549.83},0.87671232876712324,0.99999997764825821,4.9999999988358468,5.0990195080677019,5.8160691263897224,11.30993223030478,5.0744355170636535,5.7880280116507299,null,null,null,null,null,null,null,null,null,null,null,null,null,null,null,null,{"$f":"N14","v":"2014-09-13"},{"$f":"X15","v":0.82917461689949956},{"$f":"Z15","v":1.7268665198319382},{"$f":"AA15","v":-6.8517286032939051E-2}]
["80-2","2012-08-06",{"$f":"IFERROR(VLOOKUP(CONCATENATE(A25,B25),'[2]Raw Wolverine'!C:F,2,FALSE),\"N/A\")","v":7148290.0800000001},{"$f":"IFERROR(VLOOKUP(CONCATENATE(A25,B25),'[2]Raw Wolverine'!C:F,3,FALSE),\"N/A\")","v":513549.88},0.989041095890411,-0.99999997764825821,4.9999999988358468,5.0990195080677019,5.1555183391820254,-11.30993223030478,4.8764420730343492,4.9304746721815436,null,null,null,null,null,null,null,null,null,null,null,null,null,null,null,null,{"$f":"N15","v":"2015-09-17"},{"$f":"X15","v":0.82917461689949956},{"$f":"Z15","v":1.7268665198319382},{"$f":"AA15","v":-6.8517286032939051E-2}]
["80-2","2014-09-13",{"$f":"IFERROR(VLOOKUP(CONCATENATE(A26,B26),'[2]Raw Wolverine'!C:F,2,FALSE),\"N/A\")","v":7148290.0729999999},{"$f":"IFERROR(VLOOKUP(CONCATENATE(A26,B26),'[2]Raw Wolverine'!C:F,3,FALSE),\"N/A\")","v":513550.02100000001},2.1041095890410957,-0.70000002160668373,14.100000000325963,14.117365194661556,6.7094248646503498,-2.8421379711736212,13.96143969653116,6.6353196474399398]
["80-2","2015-09-17",{"$f":"IFERROR(VLOOKUP(CONCATENATE(A27,B27),'[2]Raw Wolverine'!C:F,2,FALSE),\"N/A\")","v":7148290.108},{"$f":"IFERROR(VLOOKUP(CONCATENATE(A27,B27),'[2]Raw Wolverine'!C:F,3,FALSE),\"N/A\")","v":513549.99300000002},{"$f":"IF(A27=A25,(B27-B25)/365,\"\")","v":3.1150684931506851},3.5000000149011612,-2.7999999991152436,4.4821869772861431,1.4388726883988057,128.65980812626574,-2.4397571887246841,-0.78321141062841659]
[null,"Totals From August 21, 2003 to September 17, 2015",null,null,null,{"$f":"IFERROR(IF($A27=$A16,(C27-C16)*100,\"\"),\"\")","v":5.8000000193715096},{"$f":"IFERROR(IF($A27=$A16,(D27-D16)*100,\"\"),\"\")","v":58.300000004237518},58.58779737043205,{"$f":"IFERROR(SQRT(G28^2+H28^2)/F28,\"\")","v":14.25041455430978},{"$f":"DEGREES(IF(G28=0,IF(F28>0,PI()/2,3*PI()/2),IF(G28>0,ATAN(F28/G28),PI()+ATAN(F28/G28))))","v":5.6814003360246872},{"$f":"SUM(K17:K27)","v":58.587797370432042},"",null,null,null,null,null,null,null,null,null,null,null,null,null,null,null,null,null,null,null,"80-1","80-2",26,"26-A","BH-14",1483,1495]
[26,"2003-08-21",{"$f":"IFERROR(VLOOKUP(CONCATENATE(A29,B29),'[2]Raw Wolverine'!C:F,2,FALSE),\"N/A\")","v":7148341.4500000002},{"$f":"IFERROR(VLOOKUP(CONCATENATE(A29,B29),'[2]Raw Wolverine'!C:F,3,FALSE),\"N/A\")","v":513483.53},{"$f":"IF(A29=A27,(B29-B27)/365,\"\")","v":""},{"$f":"IFERROR(IF($A29=$A27,(C29-C27)*100,\"\"),\"\")","v":""},{"$f":"IFERROR(IF($A29=$A27,(D29-D27)*100,\"\"),\"\")","v":""},"","",null,null,"",null,null,null,null,null,null,null,null,null,null,null,null,null,"Movement(cm)","Movement Rate (cm/y)","Azimuth (CW from N)",null,null,null,36.013245422907346,60.2357600097817,22.64177554595458,16.640012050611809,16.871573730431159,13.705838171154522,33.461171512498829]
[26,"2004-07-28",{"$f":"IFERROR(VLOOKUP(CONCATENATE(A30,B30),'[2]Raw Wolverine'!C:F,2,FALSE),\"N/A\")","v":7148341.4800000004},{"$f":"IFERROR(VLOOKUP(CONCATENATE(A30,B30),'[2]Raw Wolverine'!C:F,3,FALSE),\"N/A\")","v":513483.55},0.93698630136986305,3.0000000260770321,1.9999999960418791,3.6055512949658208,3.848029890826095,{"$f":"IFERROR(DEGREES(IF(G30=0,IF(F30>0,PI()/2,3*PI()/2),IF(G30>0,ATAN(F30/G30),PI()+ATAN(F30/G30)))),\"\")","v":56.309932756217037},{"$f":"IFERROR((F30*SIN(RADIANS($J$41))+G30*COS(RADIANS($J$41))),\"\")","v":3.1887958632656508},3.4032470470525218,null,null,null,null,null,null,null,null,null,null,null,null,"80-1",36.013245422907346,2.9806881132338279,{"$f":"IF(90-AI33<0,90-AI33+360,90-AI33)","v":70.389655950475714},null,null,null,2.9806881132338279,4.9854994112404354,1.873979155164041,1.3772345574769409,1.3964000933350051,1.1343834313994103,2.7694620412839166]
[26,"2004-09-23",{"$f":"IFERROR(VLOOKUP(CONCATENATE(A31,B31),'[2]Raw Wolverine'!C:F,2,FALSE),\"N/A\")","v":7148341.4900000002},{"$f":"IFERROR(VLOOKUP(CONCATENATE(A31,B31),'[2]Raw Wolverine'!C:F,3,FALSE),\"N/A\")","v":513483.55},0.15616438356164383,0.99999997764825821,0,0.99999997764825821,6.4035086288002496,{"$f":"IFERROR(DEGREES(IF(G31=0,IF(F31>0,PI()/2,3*PI()/2),IF(G31>0,ATAN(F31/G31),PI()+ATAN(F31/G31)))),\"\")","v":90},0.47699438312274461,3.0544377164877505,null,null,null,null,null,null,null,null,null,null,null,null,"80-2",60.2357600097817,4.9854994112404354,{"$f":"IF(90-AI34<0,90-AI34+360,90-AI34)","v":84.318599663975306},null,null,null,19.610344049524294,5.6814003360246872,28.489284428901435,36.938762891761478,61.308231341005438,29.744881284869631,37.349349009820088]
[26,"2005-09-17",{"$f":"IFERROR(VLOOKUP(CONCATENATE(A32,B32),'[2]Raw Wolverine'!C:F,2,FALSE),\"N/A\")","v":7148341.4699999997},{"$f":"IFERROR(VLOOKUP(CONCATENATE(A32,B32),'[2]Raw Wolverine'!C:F,3,FALSE),\"N/A\")","v":513483.57},0.98356164383561639,-2.0000000484287739,2.0000000018626451,2.8284271603075939,2.8756989234325121,-45.000000667010653,0.80382386392070682,0.81725824604751529,null,null,null,null,null,null,null,null,null,null,null,null,26,22.64177554595458,1.873979155164041,61.510715571098565]
[26,"2006-07-28",{"$f":"IFERROR(VLOOKUP(CONCATENATE(A33,B33),'[2]Raw Wolverine'!C:F,2,FALSE),\"N/A\")","v":7148341.5},{"$f":"IFERROR(VLOOKUP(CONCATENATE(A33,B33),'[2]Raw Wolverine'!C:F,3,FALSE),\"N/A\")","v":513483.58},0.86027397260273974,3.0000000260770321,1.0000000009313226,3.162277685201734,3.6758960353459647,71.565051310480129,2.3098895310866787,2.6850626714861074,null,null,null,null,null,null,null,null,null,null,null,null,"26-A",16.640012050611809,1.3772345574769409,53.061237108238522,null,null,null,"80-1",36.013245422907346,2.9806881132338279,19.610344049524294]
[26,"2008-07-09",{"$f":"IFERROR(VLOOKUP(CONCATENATE(A34,B34),'[2]Raw Wolverine'!C:F,2,FALSE),\"N/A\")","v":7148341.5},{"$f":"IFERROR(VLOOKUP(CONCATENATE(A34,B34),'[2]Raw Wolverine'!C:F,3,FALSE),\"N/A\")","v":513483.61},1.9506849315068493,0,2.9999999969732016,2.9999999969732016,1.5379213467629476,0,2.6367190067687325,1.3516888166721732,null,null,null,null,null,null,null,null,null,null,null,null,"BH-14",16.871573730431159,1.3964000933350051,28.691768658994562,null,null,null,"80-2",60.2357600097817,4.9854994112404354,5.6814003360246872]
[26,"2010-07-20",{"$f":"IFERROR(VLOOKUP(CONCATENATE(A35,B35),'[2]Raw Wolverine'!C:F,2,FALSE),\"N/A\")","v":7148341.4900000002},{"$f":"IFERROR(VLOOKUP(CONCATENATE(A35,B35),'[2]Raw Wolverine'!C:F,3,FALSE),\"N/A\")","v":513483.62},2.0301369863013701,-0.99999997764825821,1.0000000009313226,1.4142135472265713,0.69660991192671862,-44.999999332989333,0.40191195417213571,0.1979728249295945,null,null,null,null,null,null,null,null,null,null,null,null,1483,13.705838171154522,1.1343834313994103,60.255118715130365,null,null,null,26,22.64177554595458,1.873979155164041,28.489284428901435]
[26,"2010-09-25",{"$f":"IFERROR(VLOOKUP(CONCATENATE(A36,B36),'[2]Raw Wolverine'!C:F,2,FALSE),\"N/A\")","v":7148341.4900000002},{"$f":"IFERROR(VLOOKUP(CONCATENATE(A36,B36),'[2]Raw Wolverine'!C:F,3,FALSE),\"N/A\")","v":513483.66},0.18356164383561643,0,3.9999999979045242,3.9999999979045242,21.791044764703752,0,3.5156253440636132,19.152287322137596,null,null,null,null,null,null,null,null,null,null,null,null,1495,33.461171512498829,2.7694620412839166,52.650650990179912,null,null,null,"26-A",16.640012050611809,1.3772345574769409,36.938762891761478]
[26,"2011-08-11",{"$f":"IFERROR(VLOOKUP(CONCATENATE(A37,B37),'[2]Raw Wolverine'!C:F,2,FALSE),\"N/A\")","v":7148341.5},{"$f":"IFERROR(VLOOKUP(CONCATENATE(A37,B37),'[2]Raw Wolverine'!C:F,3,FALSE),\"N/A\")","v":513483.66},0.87671232876712324,{"$f":"IFERROR(IF($A37=$A36,(C37-C36)*100,\"\"),\"\")","v":0.99999997764825821},0,0.99999997764825821,1.1406249745050445,90,0.47699438312274461,0.54407171824938061,null,null,null,null,null,null,null,null,null,null,null,null,null,null,null,null,null,null,null,"BH-14",16.871573730431159,1.3964000933350051,61.308231341005438]
[26,"2012-08-06",{"$f":"IFERROR(VLOOKUP(CONCATENATE(A38,B38),'[2]Raw Wolverine'!C:F,2,FALSE),\"N/A\")","v":7148341.5300000003},{"$f":"IFERROR(VLOOKUP(CONCATENATE(A38,B38),'[2]Raw Wolverine'!C:F,3,FALSE),\"N/A\")","v":513483.69},0.989041095890411,3.0000000260770321,3.0000000027939677,4.2426407075341652,4.2896505768697235,45.000000222336887,4.06770220567644,4.1127736982601126,null,null,null,null,null,null,null,null,null,null,null,null,null,null,null,null,null,null,null,1483,13.705838171154522,1.1343834313994103,29.744881284869631]
[26,"2014-09-13",{"$f":"IFERROR(VLOOKUP(CONCATENATE(A39,B39),'[2]Raw Wolverine'!C:F,2,FALSE),\"N/A\")","v":7148341.5149999997},{"$f":"IFERROR(VLOOKUP(CONCATENATE(A39,B39),'[2]Raw Wolverine'!C:F,3,FALSE),\"N/A\")","v":513483.72200000001},2.1041095890410957,-1.5000000596046448,3.2000000006519258,3.5341194353029812,1.6796270753718596,-25.114835756622838,2.0970086581895719,0.99662520864478366,null,null,null,null,null,null,null,null,null,null,null,null,null,null,null,null,null,null,null,1495,33.461171512498829,2.7694620412839166,37.349349009820088]
[26,"2015-09-17",{"$f":"IFERROR(VLOOKUP(CONCATENATE(A40,B40),'[2]Raw Wolverine'!C:F,2,FALSE),\"N/A\")","v":7148341.5580000002},{"$f":"IFERROR(VLOOKUP(CONCATENATE(A40,B40),'[2]Raw Wolverine'!C:F,3,FALSE),\"N/A\")","v":513483.72899999999},1.010958904109589,4.3000000528991222,0.69999999832361937,4.3566042341008577,4.3093781719425834,80.753887387979461,2.6663103525655583,2.6374072593128153]
[null,"Totals From August 21, 2003 to September 17, 2015",null,null,null,{"$f":"IFERROR(IF($A40=$A29,(C40-C29)*100,\"\"),\"\")","v":10.800000000745058},{"$f":"IFERROR(IF($A40=$A29,(D40-D29)*100,\"\"),\"\")","v":19.899999996414408},22.641775545954577,{"$f":"IFERROR(SQRT(G41^2+H41^2)/F41,\"\")","v":2.7911099801280392},{"$f":"DEGREES(IF(G41=0,IF(F41>0,PI()/2,3*PI()/2),IF(G41>0,ATAN(F41/G41),PI()+ATAN(F41/G41))))","v":28.489284428901435},{"$f":"SUM(K30:K40)","v":22.64177554595458},""]
["26-A","2003-08-21",{"$f":"IFERROR(VLOOKUP(CONCATENATE(A42,B42),'[2]Raw Wolverine'!C:F,2,FALSE),\"N/A\")","v":7148339.2999999998},{"$f":"IFERROR(VLOOKUP(CONCATENATE(A42,B42),'[2]Raw Wolverine'!C:F,3,FALSE),\"N/A\")","v":513540.5},{"$f":"IF(A42=A40,(B42-B40)/365,\"\")","v":""},{"$f":"IFERROR(IF($A42=$A40,(C42-C40)*100,\"\"),\"\")","v":""},{"$f":"IFERROR(IF($A42=$A40,(D42-D40)*100,\"\"),\"\")","v":""},"","",null,null,"",null,null,null,null,null,null,null,null,null,null,null,null,{"$f":"0.8/3.3","v":0.24242424242424246},{"$f":"1-Y42","v":0.75757575757575757}]
["26-A","2004-07-28",{"$f":"IFERROR(VLOOKUP(CONCATENATE(A43,B43),'[2]Raw Wolverine'!C:F,2,FALSE),\"N/A\")","v":7148339.3200000003},{"$f":"IFERROR(VLOOKUP(CONCATENATE(A43,B43),'[2]Raw Wolverine'!C:F,3,FALSE),\"N/A\")","v":513540.52},0.93698630136986305,{"$f":"IFERROR(IF($A43=$A42,(C43-C42)*100,\"\"),\"\")","v":2.0000000484287739},2.0000000018626451,2.8284271603075939,3.018643021965707,{"$f":"IFERROR(DEGREES(IF(G43=0,IF(F43>0,PI()/2,3*PI()/2),IF(G43>0,ATAN(F43/G43),PI()+ATAN(F43/G43)))),\"\")","v":45.000000667010653},{"$f":"IFERROR((F43*SIN(RADIANS($J$54))+G43*COS(RADIANS($J$54))),\"\")","v":2.8004787781155165},2.9888150702110043]
["26-A","2004-09-23",{"$f":"IFERROR(VLOOKUP(CONCATENATE(A44,B44),'[2]Raw Wolverine'!C:F,2,FALSE),\"N/A\")","v":7148339.3200000003},{"$f":"IFERROR(VLOOKUP(CONCATENATE(A44,B44),'[2]Raw Wolverine'!C:F,3,FALSE),\"N/A\")","v":513540.49},0.15616438356164383,0,-3.0000000027939677,3.0000000027939677,19.210526333680672,{"$f":"IFERROR(DEGREES(IF(G44=0,IF(F44>0,PI()/2,3*PI()/2),IF(G44>0,ATAN(F44/G44),PI()+ATAN(F44/G44)))),\"\")","v":180},-2.3978348036983874,-15.354556199121253]
["26-A","2005-09-17",{"$f":"IFERROR(VLOOKUP(CONCATENATE(A45,B45),'[2]Raw Wolverine'!C:F,2,FALSE),\"N/A\")","v":7148339.3399999999},{"$f":"IFERROR(VLOOKUP(CONCATENATE(A45,B45),'[2]Raw Wolverine'!C:F,3,FALSE),\"N/A\")","v":513540.56},0.98356164383561639,1.9999999552965164,7.0000000006984919,7.2801098776711433,7.4017830232589619,15.945395561124972,6.7968700569915521,6.9104667710359795]
["26-A","2006-07-28",{"$f":"IFERROR(VLOOKUP(CONCATENATE(A46,B46),'[2]Raw Wolverine'!C:F,2,FALSE),\"N/A\")","v":7148339.3300000001},{"$f":"IFERROR(VLOOKUP(CONCATENATE(A46,B46),'[2]Raw Wolverine'!C:F,3,FALSE),\"N/A\")","v":513540.54},0.86027397260273974,-0.99999997764825821,-2.0000000018626451,2.2360679691697873,2.5992509832706125,206.56505064346948,-2.1995176289727882,-2.556764122850534]
["26-A","2008-07-09",{"$f":"IFERROR(VLOOKUP(CONCATENATE(A47,B47),'[2]Raw Wolverine'!C:F,2,FALSE),\"N/A\")","v":7148339.3499999996},{"$f":"IFERROR(VLOOKUP(CONCATENATE(A47,B47),'[2]Raw Wolverine'!C:F,3,FALSE),\"N/A\")","v":513540.59},1.9506849315068493,1.9999999552965164,5.0000000046566129,5.3851647948556032,2.7606533007335607,21.801409026344459,5.1983135258450393,2.6648657822098869]
["26-A","2010-07-20",{"$f":"IFERROR(VLOOKUP(CONCATENATE(A48,B48),'[2]Raw Wolverine'!C:F,2,FALSE),\"N/A\")","v":7148339.3600000003},{"$f":"IFERROR(VLOOKUP(CONCATENATE(A48,B48),'[2]Raw Wolverine'!C:F,3,FALSE),\"N/A\")","v":513540.57},2.0301369863013701,1.0000000707805157,-2.0000000018626451,2.2360680108198001,1.101437009378174,153.43494722209644,-0.99759538665619685,-0.49139313917612931]
["26-A","2010-09-25",{"$f":"IFERROR(VLOOKUP(CONCATENATE(A49,B49),'[2]Raw Wolverine'!C:F,2,FALSE),\"N/A\")","v":7148339.3499999996},{"$f":"IFERROR(VLOOKUP(CONCATENATE(A49,B49),'[2]Raw Wolverine'!C:F,3,FALSE),\"N/A\")","v":513540.6},0.18356164383561643,-1.0000000707805157,2.9999999969732016,3.1622776796796712,17.227333628105672,-18.434950056891729,1.7968736499032476,9.7889385405176927]
["26-A","2011-08-11",{"$f":"IFERROR(VLOOKUP(CONCATENATE(A50,B50),'[2]Raw Wolverine'!C:F,2,FALSE),\"N/A\")","v":7148339.3700000001},{"$f":"IFERROR(VLOOKUP(CONCATENATE(A50,B50),'[2]Raw Wolverine'!C:F,3,FALSE),\"N/A\")","v":513540.61},0.87671232876712324,2.0000000484287739,1.0000000009313226,2.2360680212323021,2.5505150867180948,63.434949356530538,2.0012005102160542,2.2826193319651868]
["26-A","2012-08-06",{"$f":"IFERROR(VLOOKUP(CONCATENATE(A51,B51),'[2]Raw Wolverine'!C:F,2,FALSE),\"N/A\")","v":7148339.3700000001},{"$f":"IFERROR(VLOOKUP(CONCATENATE(A51,B51),'[2]Raw Wolverine'!C:F,3,FALSE),\"N/A\")","v":513540.63},0.989041095890411,0,2.0000000018626451,2.0000000018626451,2.0221606667032286,0,1.5985565357989249,1.6162690735917107]
["26-A","2014-09-13",{"$f":"IFERROR(VLOOKUP(CONCATENATE(A52,B52),'[2]Raw Wolverine'!C:F,2,FALSE),\"N/A\")","v":7148339.3389999997},{"$f":"IFERROR(VLOOKUP(CONCATENATE(A52,B52),'[2]Raw Wolverine'!C:F,3,FALSE),\"N/A\")","v":513540.67200000002},2.1041095890410957,-3.1000000424683094,4.2000000015832484,5.2201532809490185,2.4809322233676978,-36.430858484876445,1.4939892673151629,0.71003396167973243]
["26-A","2015-09-17",{"$f":"IFERROR(VLOOKUP(CONCATENATE(A53,B53),'[2]Raw Wolverine'!C:F,2,FALSE),\"N/A\")","v":7148339.4000000004},{"$f":"IFERROR(VLOOKUP(CONCATENATE(A53,B53),'[2]Raw Wolverine'!C:F,3,FALSE),\"N/A\")","v":513540.63299999997},1.010958904109589,6.1000000685453415,-3.9000000047963113,7.2401658042937385,7.161681622133373,122.59258121238621,0.54867754575368366,0.54272982168047301]
[null,"Totals From August 21, 2003 to September 17, 2015",null,null,null,{"$f":"IFERROR(IF($A53=$A42,(C53-C42)*100,\"\"),\"\")","v":10.000000055879354},{"$f":"IFERROR(IF($A53=$A42,(D53-D42)*100,\"\"),\"\")","v":13.299999997252598},16.640012050611809,{"$f":"IFERROR(SQRT(G54^2+H54^2)/F54,\"\")","v":2.1302112475058399},{"$f":"DEGREES(IF(G54=0,IF(F54>0,PI()/2,3*PI()/2),IF(G54>0,ATAN(F54/G54),PI()+ATAN(F54/G54))))","v":36.938762891761478},{"$f":"SUM(K43:K53)","v":16.640012050611809},""]
["BH-14","2003-08-21",{"$f":"IFERROR(VLOOKUP(CONCATENATE(A55,B55),'[2]Raw Wolverine'!C:F,2,FALSE),\"N/A\")","v":7148488.3600000003},{"$f":"IFERROR(VLOOKUP(CONCATENATE(A55,B55),'[2]Raw Wolverine'!C:F,3,FALSE),\"N/A\")","v":513563.01},{"$f":"IF(A55=A53,(B55-B53)/365,\"\")","v":""},{"$f":"IFERROR(IF($A55=$A53,(C55-C53)*100,\"\"),\"\")","v":""},{"$f":"IFERROR(IF($A55=$A53,(D55-D53)*100,\"\"),\"\")","v":""},"","",null,null,""]
["BH-14","2004-07-28",{"$f":"IFERROR(VLOOKUP(CONCATENATE(A56,B56),'[2]Raw Wolverine'!C:F,2,FALSE),\"N/A\")","v":7148488.3600000003},{"$f":"IFERROR(VLOOKUP(CONCATENATE(A56,B56),'[2]Raw Wolverine'!C:F,3,FALSE),\"N/A\")","v":513563.01},0.93698630136986305,0,0,0,0,{"$f":"IFERROR(DEGREES(IF(G56=0,IF(F56>0,PI()/2,3*PI()/2),IF(G56>0,ATAN(F56/G56),PI()+ATAN(F56/G56)))),\"\")","v":270},{"$f":"IFERROR((F56*SIN(RADIANS($J$67))+G56*COS(RADIANS($J$67))),\"\")","v":0},0]
["BH-14","2004-09-23",{"$f":"IFERROR(VLOOKUP(CONCATENATE(A57,B57),'[2]Raw Wolverine'!C:F,2,FALSE),\"N/A\")","v":7148488.3300000001},{"$f":"IFERROR(VLOOKUP(CONCATENATE(A57,B57),'[2]Raw Wolverine'!C:F,3,FALSE),\"N/A\")","v":513562.99},0.15616438356164383,-3.0000000260770321,-2.0000000018626451,3.6055512981946012,23.088179365632097,{"$f":"IFERROR(DEGREES(IF(G57=0,IF(F57>0,PI()/2,3*PI()/2),IF(G57>0,ATAN(F57/G57),PI()+ATAN(F57/G57)))),\"\")","v":236.30993267925427},-3.5918404165375675,-23.000381614670388]
["BH-14","2005-09-17",{"$f":"IFERROR(VLOOKUP(CONCATENATE(A58,B58),'[2]Raw Wolverine'!C:F,2,FALSE),\"N/A\")","v":7148488.3399999999},{"$f":"IFERROR(VLOOKUP(CONCATENATE(A58,B58),'[2]Raw Wolverine'!C:F,3,FALSE),\"N/A\")","v":513562.87},0.98356164383561639,0.99999997764825821,-11.999999999534339,12.041594576472031,12.242846853516133,175.2363584150755,-4.8839546118122152,-4.9655805941823363]
["BH-14","2006-07-28",{"$f":"IFERROR(VLOOKUP(CONCATENATE(A59,B59),'[2]Raw Wolverine'!C:F,2,FALSE),\"N/A\")","v":7148488.3700000001},{"$f":"IFERROR(VLOOKUP(CONCATENATE(A59,B59),'[2]Raw Wolverine'!C:F,3,FALSE),\"N/A\")","v":513563.02},0.86027397260273974,{"$f":"IFERROR(IF($A59=$A58,(C59-C58)*100,\"\"),\"\")","v":3.0000000260770321},15.000000002328306,15.297058548175574,17.781612643579887,11.309932568085818,9.8331076328321068,11.430204732432225]
["BH-14","2008-07-09",{"$f":"IFERROR(VLOOKUP(CONCATENATE(A60,B60),'[2]Raw Wolverine'!C:F,2,FALSE),\"N/A\")","v":7148488.4299999997},{"$f":"IFERROR(VLOOKUP(CONCATENATE(A60,B60),'[2]Raw Wolverine'!C:F,3,FALSE),\"N/A\")","v":513563.07},1.9506849315068493,5.9999999590218067,4.9999999988358468,7.8102496436810611,4.0038498875612181,50.194428721846592,7.6637782271900043,3.9287627147813926]
["BH-14","2010-07-20",{"$f":"IFERROR(VLOOKUP(CONCATENATE(A61,B61),'[2]Raw Wolverine'!C:F,2,FALSE),\"N/A\")","v":7148488.3600000003},{"$f":"IFERROR(VLOOKUP(CONCATENATE(A61,B61),'[2]Raw Wolverine'!C:F,3,FALSE),\"N/A\")","v":513562.88},2.0301369863013701,-6.9999999366700649,-19.000000000232831,20.248456709641562,9.9739361660177721,200.22485926278856,-15.262358047966867,-7.5178956646530439]
["BH-14","2010-09-25",{"$f":"IFERROR(VLOOKUP(CONCATENATE(A62,B62),'[2]Raw Wolverine'!C:F,2,FALSE),\"N/A\")","v":7148488.3600000003},{"$f":"IFERROR(VLOOKUP(CONCATENATE(A62,B62),'[2]Raw Wolverine'!C:F,3,FALSE),\"N/A\")","v":513562.91},0.18356164383561643,0,2.9999999969732016,2.9999999969732016,16.343283565600277,0,1.4402924330247593,7.8463692246871215]
["BH-14","2011-08-11",{"$f":"IFERROR(VLOOKUP(CONCATENATE(A63,B63),'[2]Raw Wolverine'!C:F,2,FALSE),\"N/A\")","v":7148488.3700000001},{"$f":"IFERROR(VLOOKUP(CONCATENATE(A63,B63),'[2]Raw Wolverine'!C:F,3,FALSE),\"N/A\")","v":513562.9},0.87671232876712324,0.99999997764825821,-0.99999999511055648,1.4142135431106682,1.6130873226106059,135.00000050025798,0.39711765006399607,0.45296231960424554]
["BH-14","2012-08-06",{"$f":"IFERROR(VLOOKUP(CONCATENATE(A64,B64),'[2]Raw Wolverine'!C:F,2,FALSE),\"N/A\")","v":7148488.3899999997},{"$f":"IFERROR(VLOOKUP(CONCATENATE(A64,B64),'[2]Raw Wolverine'!C:F,3,FALSE),\"N/A\")","v":513562.91},0.989041095890411,1.9999999552965164,0.99999999511055648,2.236067935329153,2.2608443113438805,63.434948422715614,2.2345277275636812,2.2592870375643868]
["BH-14","2014-09-13",{"$f":"IFERROR(VLOOKUP(CONCATENATE(A65,B65),'[2]Raw Wolverine'!C:F,2,FALSE),\"N/A\")","v":7148488.4780000001},{"$f":"IFERROR(VLOOKUP(CONCATENATE(A65,B65),'[2]Raw Wolverine'!C:F,3,FALSE),\"N/A\")","v":513563.09600000002},2.1041095890410957,8.8000000454485416,18.600000004516914,20.576685859679241,9.7792842952902657,25.319687019325084,16.649306416051772,7.9127563045037723]
["BH-14","2015-09-17",{"$f":"IFERROR(VLOOKUP(CONCATENATE(A66,B66),'[2]Raw Wolverine'!C:F,2,FALSE),\"N/A\")","v":7148488.5080000004},{"$f":"IFERROR(VLOOKUP(CONCATENATE(A66,B66),'[2]Raw Wolverine'!C:F,3,FALSE),\"N/A\")","v":513563.09100000001},1.010958904109589,3.0000000260770321,-0.50000000046566129,3.0413812909478901,3.0084123880649862,99.462322135916352,2.3915967200214885,2.3656715523247787]
[null,"Totals From August 21, 2003 to September 17, 2015",null,null,null,{"$f":"IFERROR(IF($A66=$A55,(C66-C55)*100,\"\"),\"\")","v":14.800000004470348},{"$f":"IFERROR(IF($A66=$A55,(D66-D55)*100,\"\"),\"\")","v":8.1000000005587935},16.871573730431159,{"$f":"IFERROR(SQRT(G67^2+H67^2)/F67,\"\")","v":1.264542867196921},{"$f":"DEGREES(IF(G67=0,IF(F67>0,PI()/2,3*PI()/2),IF(G67>0,ATAN(F67/G67),PI()+ATAN(F67/G67))))","v":61.308231341005438},{"$f":"SUM(K56:K66)","v":16.871573730431159},""]
[1483,"2003-08-21",{"$f":"IFERROR(VLOOKUP(CONCATENATE(A68,B68),'[2]Raw Wolverine'!C:F,2,FALSE),\"N/A\")","v":7148233.0099999998},{"$f":"IFERROR(VLOOKUP(CONCATENATE(A68,B68),'[2]Raw Wolverine'!C:F,3,FALSE),\"N/A\")","v":513412.67},{"$f":"IF(A68=A66,(B68-B66)/365,\"\")","v":""},{"$f":"IFERROR(IF($A68=$A66,(C68-C66)*100,\"\"),\"\")","v":""},{"$f":"IFERROR(IF($A68=$A66,(D68-D66)*100,\"\"),\"\")","v":""},"","",null,null,""]
[1483,"2004-07-28",{"$f":"IFERROR(VLOOKUP(CONCATENATE(A69,B69),'[2]Raw Wolverine'!C:F,2,FALSE),\"N/A\")","v":7148233.0099999998},{"$f":"IFERROR(VLOOKUP(CONCATENATE(A69,B69),'[2]Raw Wolverine'!C:F,3,FALSE),\"N/A\")","v":513412.69},0.93698630136986305,0,2.0000000018626451,2.0000000018626451,2.1345029259645187,{"$f":"IFERROR(DEGREES(IF(G69=0,IF(F69>0,PI()/2,3*PI()/2),IF(G69>0,ATAN(F69/G69),PI()+ATAN(F69/G69)))),\"\")","v":0},{"$f":"IFERROR((F69*SIN(RADIANS($J$80))+G69*COS(RADIANS($J$80))),\"\")","v":1.7364862860752266},{"$f":"IFERROR(K69/E69,\"\")","v":1.8532675275364259}]
[1483,"2004-09-23",{"$f":"IFERROR(VLOOKUP(CONCATENATE(A70,B70),'[2]Raw Wolverine'!C:F,2,FALSE),\"N/A\")","v":7148233.0199999996},{"$f":"IFERROR(VLOOKUP(CONCATENATE(A70,B70),'[2]Raw Wolverine'!C:F,3,FALSE),\"N/A\")","v":513412.68},0.15616438356164383,0.99999997764825821,-1.0000000009313226,1.4142135472265713,9.0559288550473429,{"$f":"IFERROR(DEGREES(IF(G70=0,IF(F70>0,PI()/2,3*PI()/2),IF(G70>0,ATAN(F70/G70),PI()+ATAN(F70/G70)))),\"\")","v":135.00000066701065},-0.37210421595329335,-2.382772610928984]
[1483,"2005-09-17",{"$f":"IFERROR(VLOOKUP(CONCATENATE(A71,B71),'[2]Raw Wolverine'!C:F,2,FALSE),\"N/A\")","v":7148233.0300000003},{"$f":"IFERROR(VLOOKUP(CONCATENATE(A71,B71),'[2]Raw Wolverine'!C:F,3,FALSE),\"N/A\")","v":513412.71},0.98356164383561639,1.0000000707805157,3.0000000027939677,3.1622776852017349,3.2151291228374186,18.434950023541191,3.1008684024036994,3.152693501051115]
[1483,"2006-07-28",{"$f":"IFERROR(VLOOKUP(CONCATENATE(A72,B72),'[2]Raw Wolverine'!C:F,2,FALSE),\"N/A\")","v":7148233.0599999996},{"$f":"IFERROR(VLOOKUP(CONCATENATE(A72,B72),'[2]Raw Wolverine'!C:F,3,FALSE),\"N/A\")","v":513412.7},{"$f":"IF(A72=A71,(B72-B71)/365,\"\")","v":0.86027397260273974},2.9999999329447746,-1.0000000009313226,3.1622775968487171,3.675895932642617,108.43494922312841,0.62017363821534655,0.72090247754331682]
[1483,"2008-07-09",{"$f":"IFERROR(VLOOKUP(CONCATENATE(A73,B73),'[2]Raw Wolverine'!C:F,2,FALSE),\"N/A\")","v":7148233.04},{"$f":"IFERROR(VLOOKUP(CONCATENATE(A73,B73),'[2]Raw Wolverine'!C:F,3,FALSE),\"N/A\")","v":513412.75},1.9506849315068493,-1.9999999552965164,4.9999999988358468,5.3851647894511583,2.7606532979630236,-21.801409049344826,3.3489378559655862,1.7168010076228075]
[1483,"2010-07-20",{"$f":"IFERROR(VLOOKUP(CONCATENATE(A74,B74),'[2]Raw Wolverine'!C:F,2,FALSE),\"N/A\")","v":7148233.04},{"$f":"IFERROR(VLOOKUP(CONCATENATE(A74,B74),'[2]Raw Wolverine'!C:F,3,FALSE),\"N/A\")","v":513412.71},2.0301369863013701,0,-3.9999999979045242,{"$f":"IFERROR(SQRT(F74^2+G74^2),\"\")","v":3.9999999979045242},1.9703103903308383,180,-3.4729725670966132,-1.7107084844672924]
[1483,"2010-09-25",{"$f":"IFERROR(VLOOKUP(CONCATENATE(A75,B75),'[2]Raw Wolverine'!C:F,2,FALSE),\"N/A\")","v":7148233.0499999998},{"$f":"IFERROR(VLOOKUP(CONCATENATE(A75,B75),'[2]Raw Wolverine'!C:F,3,FALSE),\"N/A\")","v":513412.74},0.18356164383561643,{"$f":"IFERROR(IF($A75=$A74,(C75-C74)*100,\"\"),\"\")","v":0.99999997764825821},2.9999999969732016,3.1622776502286647,17.227333467663623,18.434948456066145,3.1008683511433199,16.892790271153906]
[1483,"2011-08-11",{"$f":"IFERROR(VLOOKUP(CONCATENATE(A76,B76),'[2]Raw Wolverine'!C:F,2,FALSE),\"N/A\")","v":7148233.04},{"$f":"IFERROR(VLOOKUP(CONCATENATE(A76,B76),'[2]Raw Wolverine'!C:F,3,FALSE),\"N/A\")","v":513412.75},0.87671232876712324,-0.99999997764825821,1.0000000009313226,1.4142135472265713,1.6130873273053079,-44.999999332989333,0.37210421595329335,0.42443137132172526]
[1483,"2012-08-06",{"$f":"IFERROR(VLOOKUP(CONCATENATE(A77,B77),'[2]Raw Wolverine'!C:F,2,FALSE),\"N/A\")","v":7148233.0599999996},{"$f":"IFERROR(VLOOKUP(CONCATENATE(A77,B77),'[2]Raw Wolverine'!C:F,3,FALSE),\"N/A\")","v":513412.77},0.989041095890411,1.9999999552965164,2.0000000018626451,2.8284270944531427,2.8597670068570555,44.999999332989333,2.7287641402438663,2.7589997539861804]
[1483,"2014-09-13",{"$f":"IFERROR(VLOOKUP(CONCATENATE(A78,B78),'[2]Raw Wolverine'!C:F,2,FALSE),\"N/A\")","v":7148233.0539999995},{"$f":"IFERROR(VLOOKUP(CONCATENATE(A78,B78),'[2]Raw Wolverine'!C:F,3,FALSE),\"N/A\")","v":513412.78100000002},2.1041095890410957,-0.60000000521540642,1.0999999998603016,1.2529964109889347,{"$f":"IFERROR(SQRT(F78^2+G78^2)/E78,\"\")","v":0.59549959636843908},-28.610459878388994,0.65738409083870675,0.31242863692204165]
[1483,"2015-09-17",{"$f":"IFERROR(VLOOKUP(CONCATENATE(A79,B79),'[2]Raw Wolverine'!C:F,2,FALSE),\"N/A\")","v":7148233.0779999997},{"$f":"IFERROR(VLOOKUP(CONCATENATE(A79,B79),'[2]Raw Wolverine'!C:F,3,FALSE),\"N/A\")","v":513412.78899999999},1.010958904109589,2.4000000208616257,0.7999999972525984,2.5298221470569748,2.5023986007474144,71.565051385518828,1.8853279733653858,1.8648908137625091]
[null,"Totals From August 21, 2003 to September 17, 2015",null,null,null,{"$f":"IFERROR(IF($A79=$A68,(C79-C68)*100,\"\"),\"\")","v":6.7999999970197678},{"$f":"IFERROR(IF($A79=$A68,(D79-D68)*100,\"\"),\"\")","v":11.90000000060536},13.705838171154523,{"$f":"IFERROR(SQRT(G80^2+H80^2)/F80,\"\")","v":2.6692695641302255},{"$f":"DEGREES(IF(G80=0,IF(F80>0,PI()/2,3*PI()/2),IF(G80>0,ATAN(F80/G80),PI()+ATAN(F80/G80))))","v":29.744881284869631},{"$f":"SUM(K69:K79)","v":13.705838171154522},""]
[1495,"2003-08-21",{"$f":"IFERROR(VLOOKUP(CONCATENATE(A81,B81),'[2]Raw Wolverine'!C:F,2,FALSE),\"N/A\")","v":7148526.5899999999},{"$f":"IFERROR(VLOOKUP(CONCATENATE(A81,B81),'[2]Raw Wolverine'!C:F,3,FALSE),\"N/A\")","v":513528.92},{"$f":"IF(A81=A79,(B81-B79)/365,\"\")","v":""},{"$f":"IFERROR(IF($A81=$A79,(C81-C79)*100,\"\"),\"\")","v":""},{"$f":"IFERROR(IF($A81=$A79,(D81-D79)*100,\"\"),\"\")","v":""},"",{"$f":"IFERROR(SQRT(F81^2+G81^2)/E81,\"\")","v":""},null,null,""]
[1495,"2004-07-28",{"$f":"IFERROR(VLOOKUP(CONCATENATE(A82,B82),'[2]Raw Wolverine'!C:F,2,FALSE),\"N/A\")","v":7148526.6200000001},{"$f":"IFERROR(VLOOKUP(CONCATENATE(A82,B82),'[2]Raw Wolverine'!C:F,3,FALSE),\"N/A\")","v":513528.97},0.93698630136986305,{"$f":"IFERROR(IF($A82=$A81,(C82-C81)*100,\"\"),\"\")","v":3.0000000260770321},4.9999999988358468,5.8309519072635698,6.2230919478105351,{"$f":"IFERROR(DEGREES(IF(G82=0,IF(F82>0,PI()/2,3*PI()/2),IF(G82>0,ATAN(F82/G82),PI()+ATAN(F82/G82)))),\"\")","v":30.96375675768007},{"$f":"IFERROR((F82*SIN(RADIANS($J$93))+G82*COS(RADIANS($J$93))),\"\")","v":5.7947762035648775},6.1844833751496502]
[1495,"2004-09-23",{"$f":"IFERROR(VLOOKUP(CONCATENATE(A83,B83),'[2]Raw Wolverine'!C:F,2,FALSE),\"N/A\")","v":7148526.6500000004},{"$f":"IFERROR(VLOOKUP(CONCATENATE(A83,B83),'[2]Raw Wolverine'!C:F,3,FALSE),\"N/A\")","v":513528.95},0.15616438356164383,3.0000000260770321,-1.9999999960418791,3.6055512949658208,23.088179344956572,{"$f":"IFERROR(DEGREES(IF(G83=0,IF(F83>0,PI()/2,3*PI()/2),IF(G83>0,ATAN(F83/G83),PI()+ATAN(F83/G83)))),\"\")","v":123.69006724378298},0.23011748274042731,1.4735593193027363]
[1495,"2005-09-17",{"$f":"IFERROR(VLOOKUP(CONCATENATE(A84,B84),'[2]Raw Wolverine'!C:F,2,FALSE),\"N/A\")","v":7148526.6500000004},{"$f":"IFERROR(VLOOKUP(CONCATENATE(A84,B84),'[2]Raw Wolverine'!C:F,3,FALSE),\"N/A\")","v":513529},0.98356164383561639,0,4.9999999988358468,4.9999999988358468,5.0835654584264178,0,3.9747562311434179,4.0411866974020825]
[1495,"2006-07-28",{"$f":"IFERROR(VLOOKUP(CONCATENATE(A85,B85),'[2]Raw Wolverine'!C:F,2,FALSE),\"N/A\")","v":7148526.6699999999},{"$f":"IFERROR(VLOOKUP(CONCATENATE(A85,B85),'[2]Raw Wolverine'!C:F,3,FALSE),\"N/A\")","v":513529.02},0.86027397260273974,1.9999999552965164,2.0000000018626451,2.8284270944531427,3.2878213040617741,44.999999332989333,2.803249104921993,3.2585538958488134]
[1495,"2008-07-09",{"$f":"IFERROR(VLOOKUP(CONCATENATE(A86,B86),'[2]Raw Wolverine'!C:F,2,FALSE),\"N/A\")","v":7148526.6900000004},{"$f":"IFERROR(VLOOKUP(CONCATENATE(A86,B86),'[2]Raw Wolverine'!C:F,3,FALSE),\"N/A\")","v":513529.07},1.9506849315068493,2.0000000484287739,4.9999999988358468,5.3851648240396104,2.760653315694463,21.801409969359533,5.1881028982580091,2.6596314014946256]
[1495,"2010-07-20",{"$f":"IFERROR(VLOOKUP(CONCATENATE(A87,B87),'[2]Raw Wolverine'!C:F,2,FALSE),\"N/A\")","v":7148526.71},{"$f":"IFERROR(VLOOKUP(CONCATENATE(A87,B87),'[2]Raw Wolverine'!C:F,3,FALSE),\"N/A\")","v":513529.1},2.0301369863013701,1.9999999552965164,2.9999999969732016,3.6055512481485099,1.7760137727047314,33.690066961586147,3.5982003474488962,1.7723928836961498]
[1495,"2010-09-25",{"$f":"IFERROR(VLOOKUP(CONCATENATE(A88,B88),'[2]Raw Wolverine'!C:F,2,FALSE),\"N/A\")","v":7148526.7199999997},{"$f":"IFERROR(VLOOKUP(CONCATENATE(A88,B88),'[2]Raw Wolverine'!C:F,3,FALSE),\"N/A\")","v":513529.11},0.18356164383561643,0.99999997764825821,1.0000000009313226,1.4142135472265713,7.7042976826522169,44.999999332989333,1.4016245524609965,7.635715845496474]
[1495,"2011-08-11",{"$f":"IFERROR(VLOOKUP(CONCATENATE(A89,B89),'[2]Raw Wolverine'!C:F,2,FALSE),\"N/A\")","v":7148526.71},{"$f":"IFERROR(VLOOKUP(CONCATENATE(A89,B89),'[2]Raw Wolverine'!C:F,3,FALSE),\"N/A\")","v":513529.13},0.87671232876712324,-0.99999997764825821,2.0000000018626451,2.2360679691697873,2.5505150273342889,-26.565050643469458,0.98322918900138934,1.1214957937047099]
[1495,"2012-08-06",{"$f":"IFERROR(VLOOKUP(CONCATENATE(A90,B90),'[2]Raw Wolverine'!C:F,2,FALSE),\"N/A\")","v":7148526.7300000004},{"$f":"IFERROR(VLOOKUP(CONCATENATE(A90,B90),'[2]Raw Wolverine'!C:F,3,FALSE),\"N/A\")","v":513529.16},0.989041095890411,2.0000000484287739,2.9999999969732016,3.6055512998089916,3.6455020067320829,33.690068192990445,3.5982004039497522,3.6380696605032119]
[1495,"2014-09-13",{"$f":"IFERROR(VLOOKUP(CONCATENATE(A91,B91),'[2]Raw Wolverine'!C:F,2,FALSE),\"N/A\")","v":7148526.801},{"$f":"IFERROR(VLOOKUP(CONCATENATE(A91,B91),'[2]Raw Wolverine'!C:F,3,FALSE),\"N/A\")","v":513529.18699999998},2.1041095890410957,7.0999999530613422,2.7000000001862645,7.5960515621260027,3.6101026304374888,69.17910701952944,6.4537489009450457,3.0672113917251846]
[1495,"2015-09-17",{"$f":"IFERROR(VLOOKUP(CONCATENATE(A92,B92),'[2]Raw Wolverine'!C:F,2,FALSE),\"N/A\")","v":7148526.7929999996},{"$f":"IFERROR(VLOOKUP(CONCATENATE(A92,B92),'[2]Raw Wolverine'!C:F,3,FALSE),\"N/A\")","v":513529.18599999999},1.010958904109589,-0.80000003799796104,-9.9999998928979039E-2,0.80622581240154723,0.79748623719936251,262.87498406156629,-0.56483380193597554,-0.55871094229439322]
[null,"Totals From August 21, 2003 to September 17, 2015",null,null,null,{"$f":"IFERROR(IF($A92=$A81,(C92-C81)*100,\"\"),\"\")","v":20.299999974668026},{"$f":"IFERROR(IF($A92=$A81,(D92-D81)*100,\"\"),\"\")","v":26.600000000325963},33.461171512498829,{"$f":"IFERROR(SQRT(G93^2+H93^2)/F93,\"\")","v":2.1057082283684214},{"$f":"DEGREES(IF(G93=0,IF(F93>0,PI()/2,3*PI()/2),IF(G93>0,ATAN(F93/G93),PI()+ATAN(F93/G93))))","v":37.349349009820088},{"$f":"SUM(K82:K92)","v":33.461171512498829},""]